{"text_format":"1","workbook":"xlsx","n_sheets":15,"sheets":["MATRICULA","APROV 1","PARTICIPACIÓN 1","Gráfica APROV 1","Gráfica PART 1","APROV 2","PARTICIPACIÓN 2","Gráfica APROV 2","Gráfica PART 2","APROV 3","PARTICIPACIÓN 3","Gráfica APROV 3","Gráfica PART 3","Gráfica Promedios Finales","NORMALIDAD MÍNIMA"],"not_rendered":{"charts":7,"images":1,"macros":1,"external_links":0,"defined_names":3,"comments":0,"pivot_tables":0},"unopened":[],"bounds":{"document_bytes":16777216,"sheet_cells":100000,"rows_first":2000,"rows_last":500,"rows_between":2000,"halvings":0,"cell_chars":16384,"cell_head_chars":4096},"cells_cut":0,"cells_raw":0,"read":"whole","date_system":"1900"}

{"sheet":"MATRICULA","index":0,"n_rows":43,"n_cols":38,"rows_kept":43,"cut":false,"hidden":false,"merged":[[9,1,9,6],[9,8,9,26],[10,32,10,33],[10,27,10,31],[10,1,10,3],[10,8,10,26],[2,2,2,30],[3,2,3,30],[4,2,4,30],[6,2,6,13],[6,14,6,26],[5,2,5,13],[5,14,5,26],[28,26,29,37],[29,2,29,13],[29,14,29,25],[14,17,14,19],[14,20,14,22],[14,23,14,25],[30,35,30,37],[30,8,30,10],[30,11,30,13],[30,14,30,16],[30,17,30,19],[30,20,30,22],[30,23,30,25],[30,26,30,28],[30,29,30,31],[30,32,30,34],[28,1,31,1],[28,2,28,25],[12,1,15,1],[12,2,12,25],[30,2,30,4],[30,5,30,7],[13,2,13,13],[13,14,13,25],[14,2,14,4],[14,5,14,7],[14,8,14,10],[14,11,14,13],[14,14,14,16]]}
[]
[]
[null,null,"Secretaría de Educación Pública del Estado de Baja California Sur"]
[null,null,"Dirección de Educación Secundaria"]
[null,null,"MATRÍCULA"]
[null,null,"PERIODO DE EVALUACIÓN:",null,null,null,null,null,null,null,null,null,null,null,"2DO TRIMESTRE"]
[null,null,"CICLO ESCOLAR :",null,null,null,null,null,null,null,null,null,null,null,"2021-2022"]
[]
[]
[null,"DIRECCIÓN: ",null,null,null,null,null,null,"EDUCACIÓN SECUNDARIA"]
[null,"DIRECTORA:",null,null,null,null,null,null,"MTRA. OFELIA ELIZABETH OCHOA ROMERO"]
[]
[null,"Modalidad","MATRÍCULA"]
[null,null,"INSCRIPCIÓN INICIAL ",null,null,null,null,null,null,null,null,null,null,null,"CAMBIOS DESDE OTRAS ESCUELAS (ALTAS)"]
[null,null,"PRIMERO",null,null,"SEGUNDO",null,null,"TERCERO",null,null,"TOTAL",null,null,"PRIMERO",null,null,"SEGUNDO",null,null,"TERCERO",null,null,"TOTAL"]
[null,null,"H","M","T","H","M","T","H","M","T","H","M","T","H","M","T","H","M","T","H","M","T","H","M","T"]
[null,"Generales Públicas",2811,2721,{"$f":"IF(SUM(C17,D17)=0,\"\",SUM(C17,D17))","v":5532},2833,2891,{"$f":"IF(SUM(F17,G17)=0,\"\",SUM(F17,G17))","v":5724},2667,2732,{"$f":"IF(SUM(I17,J17)=0,\"\",SUM(I17,J17))","v":5399},{"$f":"IF(SUM(C17,F17,I17)=0,\"\",SUM(C17,F17,I17))","v":8311},{"$f":"IF(SUM(D17,G17,J17)=0,\"\",SUM(SUM(D17,G17,J17)))","v":8344},{"$f":"IF(SUM(L17,M17)=0,\"\",SUM(L17,M17))","v":16655},83,86,{"$f":"IF(SUM(O17,P17)=0,\"\",SUM(O17,P17))","v":169},69,92,{"$f":"IF(SUM(R17,S17)=0,\"\",SUM(R17,S17))","v":161},56,73,{"$f":"IF(SUM(U17,V17)=0,\"\",SUM(U17,V17))","v":129},{"$f":"IF(SUM(O17,R17,U17)=0,\"\",SUM(O17,R17,U17))","v":208},{"$f":"IF(SUM(P17,S17,V17)=0,\"\",SUM(SUM(P17,S17,V17)))","v":251},{"$f":"IF(SUM(X17,Y17)=0,\"\",SUM(X17,Y17))","v":459}]
[null,"Particulares",586,618,{"$f":"IF(SUM(C18,D18)=0,\"\",SUM(C18,D18))","v":1204},553,632,{"$f":"IF(SUM(F18,G18)=0,\"\",SUM(F18,G18))","v":1185},580,600,{"$f":"IF(SUM(I18,J18)=0,\"\",SUM(I18,J18))","v":1180},{"$f":"IF(SUM(C18,F18,I18)=0,\"\",SUM(C18,F18,I18))","v":1719},{"$f":"IF(SUM(D18,G18,J18)=0,\"\",SUM(SUM(D18,G18,J18)))","v":1850},{"$f":"IF(SUM(L18,M18)=0,\"\",SUM(L18,M18))","v":3569},22,23,{"$f":"IF(SUM(O18,P18)=0,\"\",SUM(O18,P18))","v":45},21,18,{"$f":"IF(SUM(R18,S18)=0,\"\",SUM(R18,S18))","v":39},19,16,{"$f":"IF(SUM(U18,V18)=0,\"\",SUM(U18,V18))","v":35},{"$f":"IF(SUM(O18,R18,U18)=0,\"\",SUM(O18,R18,U18))","v":62},{"$f":"IF(SUM(P18,S18,V18)=0,\"\",SUM(SUM(P18,S18,V18)))","v":57},{"$f":"IF(SUM(X18,Y18)=0,\"\",SUM(X18,Y18))","v":119}]
[null,"Secundaria Técnica",2599,2552,5151,2559,2604,5163,2541,2506,5047,7699,7662,15361,81,65,146,75,73,148,64,77,141,220,215,435]
[null,"Telesecundaria",940,835,1775,902,771,1673,872,832,1704,2714,2438,5152,26,20,46,25,22,47,20,22,42,71,64,135]
[null,null,null,null,{"$f":"IF(SUM(C21,D21)=0,\"\",SUM(C21,D21))","v":""},null,null,{"$f":"IF(SUM(F21,G21)=0,\"\",SUM(F21,G21))","v":""},null,null,{"$f":"IF(SUM(I21,J21)=0,\"\",SUM(I21,J21))","v":""},{"$f":"IF(SUM(C21,F21,I21)=0,\"\",SUM(C21,F21,I21))","v":""},{"$f":"IF(SUM(D21,G21,J21)=0,\"\",SUM(SUM(D21,G21,J21)))","v":""},{"$f":"IF(SUM(L21,M21)=0,\"\",SUM(L21,M21))","v":""},null,null,{"$f":"IF(SUM(O21,P21)=0,\"\",SUM(O21,P21))","v":""},null,null,{"$f":"IF(SUM(R21,S21)=0,\"\",SUM(R21,S21))","v":""},null,null,{"$f":"IF(SUM(U21,V21)=0,\"\",SUM(U21,V21))","v":""},{"$f":"IF(SUM(O21,R21,U21)=0,\"\",SUM(O21,R21,U21))","v":""},{"$f":"IF(SUM(P21,S21,V21)=0,\"\",SUM(SUM(P21,S21,V21)))","v":""},{"$f":"IF(SUM(X21,Y21)=0,\"\",SUM(X21,Y21))","v":""}]
[null,null,null,null,"",null,null,"",null,null,"","","","",null,null,"",null,null,"",null,null,"","","",""]
[null,null,null,null,"",null,null,"",null,null,"","","","",null,null,"",null,null,"",null,null,"","","",""]
[null,null,null,null,"",null,null,"",null,null,"","","","",null,null,"",null,null,"",null,null,"","","",""]
[null,null,null,null,"",null,null,"",null,null,"","","","",null,null,"",null,null,"",null,null,"","","",""]
[null,null,null,null,"",null,null,"",null,null,"","","","",null,null,"",null,null,"",null,null,"","","",""]
[null,"TOTAL",{"$f":"IF(SUM(C17:C26)=0,\"\",SUM(C17:C26))","v":6936},6726,13662,6847,6898,13745,6660,6670,13330,20443,20294,40737,212,194,406,190,205,395,159,188,347,561,587,1148]
[]
[null,"Modalidad","BAJAS",null,null,null,null,null,null,null,null,null,null,null,null,null,null,null,null,null,null,null,null,null,null,null,"EXISTENCIA"]
[null,null,"DESERCIÓN",null,null,null,null,null,null,null,null,null,null,null,"CAMBIOS HACIA OTRAS ESCUELAS (TRASLADOS)"]
[null,null,"PRIMERO",null,null,"SEGUNDO",null,null,"TERCERO",null,null,"TOTAL",null,null,"PRIMERO",null,null,"SEGUNDO",null,null,"TERCERO",null,null,"TOTAL",null,null,"PRIMERO",null,null,"SEGUNDO",null,null,"TERCERO",null,null,"TOTAL"]
[null,null,"H","M","T","H","M","T","H","M","T","H","M","T","H","M","T","H","M","T","H","M","T","H","M","T","H","M","T","H","M","T","H","M","T","H","M","T"]
[null,{"$f":"IF(B17=0,\"\",B17)","v":"Generales Públicas"},17,16,{"$f":"IF(SUM(C33,D33)=0,\"\",SUM(C33,D33))","v":33},9,15,{"$f":"IF(SUM(F33,G33)=0,\"\",SUM(F33,G33))","v":24},18,14,{"$f":"IF(SUM(I33,J33)=0,\"\",SUM(I33,J33))","v":32},{"$f":"IF(SUM(C33,F33,I33)=0,\"\",SUM(C33,F33,I33))","v":44},{"$f":"IF(SUM(D33,G33,J33)=0,\"\",SUM(SUM(D33,G33,J33)))","v":45},{"$f":"IF(SUM(L33,M33)=0,\"\",SUM(L33,M33))","v":89},92,91,{"$f":"IF(SUM(O33,P33)=0,\"\",SUM(O33,P33))","v":183},95,103,{"$f":"IF(SUM(R33,S33)=0,\"\",SUM(R33,S33))","v":198},71,86,{"$f":"IF(SUM(U33,V33)=0,\"\",SUM(U33,V33))","v":157},{"$f":"IF(SUM(O33,R33,U33)=0,\"\",SUM(O33,R33,U33))","v":258},{"$f":"IF(SUM(P33,S33,V33)=0,\"\",SUM(SUM(P33,S33,V33)))","v":280},{"$f":"IF(SUM(X33,Y33)=0,\"\",SUM(X33,Y33))","v":538},{"$f":"IF(SUM(C17,O17-C33-O33)=0,\"\",SUM(C17,O17-C33-O33))","v":2785},{"$f":"IF(SUM(D17,P17-D33-P33)=0,\"\",SUM(D17,P17-D33-P33))","v":2700},{"$f":"IF(SUM(AA33,AB33)=0,\"\",SUM(AA33,AB33))","v":5485},{"$f":"IF(SUM(F17,R17-F33-R33)=0,\"\",SUM(F17,R17-F33-R33))","v":2798},{"$f":"IF(SUM(G17,S17-G33-S33)=0,\"\",SUM(G17,S17-G33-S33))","v":2865},{"$f":"IF(SUM(AD33,AE33)=0,\"\",SUM(AD33,AE33))","v":5663},{"$f":"IF(SUM(I17,U17-I33-U33)=0,\"\",SUM(I17,U17-I33-U33))","v":2634},{"$f":"IF(SUM(J17,V17-J33-V33)=0,\"\",SUM(J17,V17-J33-V33))","v":2705},{"$f":"IF(SUM(AG33,AH33)=0,\"\",SUM(AG33,AH33))","v":5339},{"$f":"IF(SUM(AA33,AD33,AG33)=0,\"\",SUM(AA33,AD33,AG33))","v":8217},{"$f":"IF(SUM(AB33,AE33,AH33)=0,\"\",SUM(SUM(AB33,AE33,AH33)))","v":8270},{"$f":"IF(SUM(AJ33,AK33)=0,\"\",SUM(AJ33,AK33))","v":16487}]
[null,"Particulares",1,null,{"$f":"IF(SUM(C34,D34)=0,\"\",SUM(C34,D34))","v":1},null,1,{"$f":"IF(SUM(F34,G34)=0,\"\",SUM(F34,G34))","v":1},1,1,{"$f":"IF(SUM(I34,J34)=0,\"\",SUM(I34,J34))","v":2},{"$f":"IF(SUM(C34,F34,I34)=0,\"\",SUM(C34,F34,I34))","v":2},{"$f":"IF(SUM(D34,G34,J34)=0,\"\",SUM(SUM(D34,G34,J34)))","v":2},{"$f":"IF(SUM(L34,M34)=0,\"\",SUM(L34,M34))","v":4},12,4,{"$f":"IF(SUM(O34,P34)=0,\"\",SUM(O34,P34))","v":16},10,8,{"$f":"IF(SUM(R34,S34)=0,\"\",SUM(R34,S34))","v":18},5,11,{"$f":"IF(SUM(U34,V34)=0,\"\",SUM(U34,V34))","v":16},{"$f":"IF(SUM(O34,R34,U34)=0,\"\",SUM(O34,R34,U34))","v":27},{"$f":"IF(SUM(P34,S34,V34)=0,\"\",SUM(SUM(P34,S34,V34)))","v":23},{"$f":"IF(SUM(X34,Y34)=0,\"\",SUM(X34,Y34))","v":50},{"$f":"IF(SUM(C18,O18-C34-O34)=0,\"\",SUM(C18,O18-C34-O34))","v":595},637,1232,{"$f":"IF(SUM(F18,R18-F34-R34)=0,\"\",SUM(F18,R18-F34-R34))","v":564},{"$f":"IF(SUM(G18,S18-G34-S34)=0,\"\",SUM(G18,S18-G34-S34))","v":641},{"$f":"IF(SUM(AD34,AE34)=0,\"\",SUM(AD34,AE34))","v":1205},{"$f":"IF(SUM(I18,U18-I34-U34)=0,\"\",SUM(I18,U18-I34-U34))","v":593},{"$f":"IF(SUM(J18,V18-J34-V34)=0,\"\",SUM(J18,V18-J34-V34))","v":604},{"$f":"IF(SUM(AG34,AH34)=0,\"\",SUM(AG34,AH34))","v":1197},{"$f":"IF(SUM(AA34,AD34,AG34)=0,\"\",SUM(AA34,AD34,AG34))","v":1752},{"$f":"IF(SUM(AB34,AE34,AH34)=0,\"\",SUM(SUM(AB34,AE34,AH34)))","v":1882},{"$f":"IF(SUM(AJ34,AK34)=0,\"\",SUM(AJ34,AK34))","v":3634}]
[null,{"$f":"IF(B19=0,\"\",B19)","v":"Secundaria Técnica"},10,10,20,19,12,31,19,10,29,48,32,80,100,88,188,85,84,169,64,84,148,249,256,505,2570,2519,5089,{"$f":"IF(SUM(F19,R19-F35-R35)=0,\"\",SUM(F19,R19-F35-R35))","v":2530},2581,5111,{"$f":"IF(SUM(I19,U19-I35-U35)=0,\"\",SUM(I19,U19-I35-U35))","v":2522},2489,5011,7622,7589,15211]
[null,"Telesecundaria",6,8,14,26,9,35,27,18,45,59,35,94,28,22,50,34,24,58,33,21,54,95,67,162,932,825,1757,867,760,1627,832,815,1647,2631,2400,5031]
[null,"",null,null,{"$f":"IF(SUM(C37,D37)=0,\"\",SUM(C37,D37))","v":""},null,null,{"$f":"IF(SUM(F37,G37)=0,\"\",SUM(F37,G37))","v":""},null,null,{"$f":"IF(SUM(I37,J37)=0,\"\",SUM(I37,J37))","v":""},{"$f":"IF(SUM(C37,F37,I37)=0,\"\",SUM(C37,F37,I37))","v":""},{"$f":"IF(SUM(D37,G37,J37)=0,\"\",SUM(SUM(D37,G37,J37)))","v":""},{"$f":"IF(SUM(L37,M37)=0,\"\",SUM(L37,M37))","v":""},null,null,{"$f":"IF(SUM(O37,P37)=0,\"\",SUM(O37,P37))","v":""},null,null,{"$f":"IF(SUM(R37,S37)=0,\"\",SUM(R37,S37))","v":""},null,null,{"$f":"IF(SUM(U37,V37)=0,\"\",SUM(U37,V37))","v":""},{"$f":"IF(SUM(O37,R37,U37)=0,\"\",SUM(O37,R37,U37))","v":""},{"$f":"IF(SUM(P37,S37,V37)=0,\"\",SUM(SUM(P37,S37,V37)))","v":""},{"$f":"IF(SUM(X37,Y37)=0,\"\",SUM(X37,Y37))","v":""},"","",{"$f":"IF(SUM(AA37,AB37)=0,\"\",SUM(AA37,AB37))","v":""},"","",{"$f":"IF(SUM(AD37,AE37)=0,\"\",SUM(AD37,AE37))","v":""},"","",{"$f":"IF(SUM(AG37,AH37)=0,\"\",SUM(AG37,AH37))","v":""},{"$f":"IF(SUM(AA37,AD37,AG37)=0,\"\",SUM(AA37,AD37,AG37))","v":""},{"$f":"IF(SUM(AB37,AE37,AH37)=0,\"\",SUM(SUM(AB37,AE37,AH37)))","v":""},{"$f":"IF(SUM(AJ37,AK37)=0,\"\",SUM(AJ37,AK37))","v":""}]
[null,"",null,null,"",null,null,"",null,null,"","","","",null,null,"",null,null,"",null,null,"","","","","","","","","","","","","","","",""]
[null,"",null,null,"",null,null,"",null,null,"","","","",null,null,"",null,null,"",null,null,"","","","","","","","","","","","","","","",""]
[null,"",null,null,"",null,null,"",null,null,"","","","",null,null,"",null,null,"",null,null,"","","","","","","","","","","","","","","",""]
[null,"",null,null,"",null,null,"",null,null,"","","","",null,null,"",null,null,"",null,null,"","","","","","","","","","","","","","","",""]
[null,"",null,null,"",null,null,"",null,null,"","","","",null,null,"",null,null,"",null,null,"","","","","","","","","","","","","","","",""]
[null,"TOTAL",{"$f":"IF(SUM(C33:C42)=0,\"\",SUM(C33:C42))","v":34},34,68,54,37,91,65,43,108,153,114,267,232,205,437,224,219,443,173,202,375,629,626,1255,6882,6681,13563,6759,6847,13606,6581,6613,13194,20222,20141,40363]

{"sheet":"APROV 1","index":1,"n_rows":43,"n_cols":33,"rows_kept":43,"cut":false,"hidden":false,"merged":[[9,0,9,5],[10,7,10,25],[10,26,10,30],[9,7,9,25],[21,1,21,3],[21,4,21,6],[21,7,21,9],[21,10,21,12],[21,13,21,15],[21,16,21,18],[21,19,21,21],[21,22,21,24],[21,25,21,27],[19,1,19,3],[19,4,19,6],[19,7,19,9],[19,10,19,12],[19,13,19,15],[19,16,19,18],[19,19,19,21],[19,22,19,24],[20,1,20,3],[20,4,20,6],[20,7,20,9],[20,10,20,12],[20,13,20,15],[20,16,20,18],[20,19,20,21],[20,22,20,24],[20,25,20,27],[17,1,17,3],[17,4,17,6],[17,7,17,9],[17,10,17,12],[17,13,17,15],[17,16,17,18],[17,19,17,21],[17,22,17,24],[17,25,17,27],[18,1,18,3],[18,4,18,6],[18,7,18,9],[18,10,18,12],[18,13,18,15],[18,16,18,18],[18,19,18,21],[18,22,18,24],[18,25,18,27],[18,31,18,32],[19,28,19,30],[19,31,19,32],[20,28,20,30],[20,31,20,32],[21,28,21,30],[21,31,21,32],[15,13,15,15],[15,16,15,18],[15,19,15,21],[15,22,15,24],[15,25,15,27],[15,28,15,30],[15,31,15,32],[16,28,16,30],[16,31,16,32],[16,13,16,15],[16,16,16,18],[16,19,16,21],[16,22,16,24],[16,25,16,27],[19,25,19,27],[42,0,44,32],[45,0,72,32],[0,0,0,32],[2,1,2,29],[3,1,3,29],[4,1,4,29],[5,1,5,29],[10,0,10,2],[27,0,27,24],[22,10,22,12],[23,10,23,12],[24,10,24,12],[22,25,22,27],[23,31,23,32],[24,31,24,32],[24,28,24,30],[17,28,17,30],[17,31,17,32],[18,28,18,30],[22,4,22,6],[23,4,23,6],[24,4,24,6],[22,31,22,32],[22,1,22,3],[14,7,14,9],[13,19,13,21],[23,1,23,3],[25,19,25,21],[25,25,25,27],[25,22,25,24],[24,25,24,27],[23,25,23,27],[22,7,22,9],[22,22,22,24],[23,22,23,24],[24,22,24,24],[22,16,22,18],[23,16,23,18],[24,16,24,18],[24,19,24,21],[23,7,23,9],[24,7,24,9],[24,1,24,3],[24,13,24,15],[16,1,16,3],[16,4,16,6],[16,7,16,9],[16,10,16,12],[12,31,12,32],[14,13,14,15],[22,13,22,15],[23,13,23,15],[13,28,13,30],[14,28,14,30],[22,28,22,30],[23,28,23,30],[12,0,12,24],[22,19,22,21],[23,19,23,21],[14,31,14,32],[13,31,13,32],[13,0,14,0],[13,1,13,3],[13,4,13,6],[13,7,13,9],[13,10,13,12],[13,13,13,15],[13,16,13,18],[13,25,13,27],[14,25,14,27],[14,16,14,18],[13,22,13,24],[27,31,27,32],[25,28,25,30],[28,28,28,30],[28,10,28,12],[28,13,28,15],[28,19,28,21],[28,25,28,27],[28,31,28,32],[25,10,25,12],[25,13,25,15],[25,31,25,32],[25,16,25,18],[6,1,6,12],[7,1,7,12],[6,13,6,25],[7,13,7,25],[28,1,28,3],[28,0,29,0],[28,4,28,6],[28,7,28,9],[28,16,28,18],[28,22,28,24],[25,1,25,3],[25,7,25,9],[25,4,25,6],[27,25,27,30],[14,4,14,6],[12,25,12,30],[14,22,14,24],[15,1,15,3],[15,4,15,6],[15,7,15,9],[15,10,15,12],[14,19,14,21],[14,1,14,3],[14,10,14,12]]}
[]
[]
[null,"Secretaría de Educación Pública del Estado de Baja California Sur"]
[null,"Dirección de Educación Secundaria"]
[null,"APROVECHAMIENTO Y RIESGO DE NO ACREDITAR"]
[null,"PRIMER GRADO "]
[null,"PERIODO EVALUACIÓN:",null,null,null,null,null,null,null,null,null,null,null,{"$f":"IF(MATRICULA!O6=0,\"\",MATRICULA!O6)","v":"2DO TRIMESTRE"}]
[null,"CICLO ESCOLAR :",null,null,null,null,null,null,null,null,null,null,null,{"$f":"IF(MATRICULA!O7=0,\"\",MATRICULA!O7)","v":"2021-2022"}]
[]
["DIRECCIÓN: ",null,null,null,null,null,null,"EDUCACIÓN SECUNDARIA"]
["DIRECTORA:",null,null,null,null,null,null,"MTRA. OFELIA ELIZABETH OCHOA ROMERO"]
[]
["Promedio de Aprovechamiento de los Campos de Formación Académica",null,null,null,null,null,null,null,null,null,null,null,null,null,null,null,null,null,null,null,null,null,null,null,null,"Promedio de Aprovechamiento de las Áreas de Desarrollo Personal y Social"]
["Modalidad","Lengua Materna ",null,null,"Matemáticas",null,null,"Inglés",null,null,"Ciencias y tecnología (Biología)",null,null,"Historia",null,null,"Geografía",null,null,"Formación Cívica y Ética",null,null,"Tecnología I",null,null,"Educación Física",null,null,"Artes",null,null,"Prom. Final"]
[null,"CALIF",null,null,"CALIF",null,null,"CALIF",null,null,"CALIF",null,null,"CALIF",null,null,"CALIF",null,null,"CALIF",null,null,"CALIF",null,null,"CALIF",null,null,"CALIF",null,null,"CALIF"]
[{"$f":"IF(MATRICULA!B17=0,\"\",MATRICULA!B17)","v":"Generales Públicas"},8.6,null,null,8.3000000000000007,null,null,8.6999999999999993,null,null,8.6999999999999993,null,null,8.6999999999999993,null,null,8.6999999999999993,null,null,8.6999999999999993,null,null,8.9,null,null,9.1999999999999993,null,null,9,null,null,{"$f":"IFERROR(ROUND(AVERAGE(B16:AE16),1),\"\")","v":8.8000000000000007}]
[{"$f":"IF(MATRICULA!B18=0,\"\",MATRICULA!B18)","v":"Particulares"},8.6,null,null,8.4,null,null,8.6,null,null,8.6999999999999993,null,null,8.6999999999999993,null,null,8.6,null,null,9,null,null,9,null,null,9.5,null,null,9.4,null,null,{"$f":"IFERROR(ROUND(AVERAGE(B17:AE17),1),\"\")","v":8.9}]
["Secundarias Técnicas",8.3000000000000007,null,null,8.3000000000000007,null,null,8.5,null,null,8.5,null,null,8.4,null,null,8.5,null,null,8.5,null,null,8.6999999999999993,null,null,9.1999999999999993,null,null,8.6999999999999993,null,null,8.6]
[{"$f":"IF(MATRICULA!B20=0,\"\",MATRICULA!B20)","v":"Telesecundaria"},8.3000000000000007,null,null,8.1,null,null,8.3000000000000007,null,null,8.4,null,null,8.1999999999999993,null,null,8.3000000000000007,null,null,8.6,null,null,9,null,null,9.1,null,null,9,null,null,8.5]
[{"$f":"IF(MATRICULA!B21=0,\"\",MATRICULA!B21)","v":""},null,null,null,null,null,null,null,null,null,null,null,null,null,null,null,null,null,null,null,null,null,null,null,null,null,null,null,null,null,null,""]
[{"$f":"IF(MATRICULA!B22=0,\"\",MATRICULA!B22)","v":""},null,null,null,null,null,null,null,null,null,null,null,null,null,null,null,null,null,null,null,null,null,null,null,null,null,null,null,null,null,null,""]
[{"$f":"IF(MATRICULA!B23=0,\"\",MATRICULA!B23)","v":""},null,null,null,null,null,null,null,null,null,null,null,null,null,null,null,null,null,null,null,null,null,null,null,null,null,null,null,null,null,null,""]
[{"$f":"IF(MATRICULA!B24=0,\"\",MATRICULA!B24)","v":""},null,null,null,null,null,null,null,null,null,null,null,null,null,null,null,null,null,null,null,null,null,null,null,null,null,null,null,null,null,null,""]
[{"$f":"IF(MATRICULA!B25=0,\"\",MATRICULA!B25)","v":""},null,null,null,null,null,null,null,null,null,null,null,null,null,null,null,null,null,null,null,null,null,null,null,null,null,null,null,null,null,null,""]
[{"$f":"IF(MATRICULA!B26=0,\"\",MATRICULA!B26)","v":""},null,null,null,null,null,null,null,null,null,null,null,null,null,null,null,null,null,null,null,null,null,null,null,null,null,null,null,null,null,null,""]
["Gral.",{"$f":"IFERROR(ROUND(AVERAGE(B16:D25),1),\"\")","v":8.5},null,null,{"$f":"IFERROR(ROUND(AVERAGE(E16:G25),1),\"\")","v":8.3000000000000007},null,null,{"$f":"IFERROR(ROUND(AVERAGE(H16:J25),1),\"\")","v":8.5},null,null,{"$f":"IFERROR(ROUND(AVERAGE(K16:M25),1),\"\")","v":8.6},null,null,{"$f":"IFERROR(ROUND(AVERAGE(N16:P25),1),\"\")","v":8.5},null,null,{"$f":"IFERROR(ROUND(AVERAGE(Q16:S25),1),\"\")","v":8.5},null,null,{"$f":"IFERROR(ROUND(AVERAGE(T16:V25),1),\"\")","v":8.6999999999999993},null,null,{"$f":"IFERROR(ROUND(AVERAGE(W16:Y25),1),\"\")","v":8.9},null,null,{"$f":"IFERROR(ROUND(AVERAGE(Z16:AB25),1),\"\")","v":9.3000000000000007},null,null,{"$f":"IFERROR(ROUND(AVERAGE(AC16:AE25),1),\"\")","v":9},null,null,{"$f":"IFERROR(ROUND(AVERAGE(AF16:AG25),1),\"\")","v":8.6999999999999993}]
[]
["Campos de Formación Académica en riesgo de no acreditar",null,null,null,null,null,null,null,null,null,null,null,null,null,null,null,null,null,null,null,null,null,null,null,null,"Áreas de Desarrollo Personal y Social en situación de riesgo de no acreditar"]
["Modalidad","Lengua Materna",null,null,"Matemáticas",null,null,"Inglés",null,null,"Ciencias y tecnología (Biología)",null,null,"Historia",null,null,"Geografía",null,null,"Formación Cívica y Ética",null,null,"Tecnología I",null,null,"Educación Física",null,null,"Artes",null,null,"Total"]
[null,5,6,"T",5,6,"T",5,6,"T",5,6,"T",5,6,"T",5,6,"T",5,6,"T",5,6,"T",5,6,"T",5,6,"T",5,6]
[{"$f":"IF(MATRICULA!B17=0,\"\",MATRICULA!B17)","v":"Generales Públicas"},null,339,{"$f":"IF(SUM(B31,C31)=0,\"\",SUM(B31,C31))","v":339},null,645,{"$f":"IF(SUM(E31,F31)=0,\"\",SUM(E31,F31))","v":645},null,352,{"$f":"IF(SUM(H31,I31)=0,\"\",SUM(H31,I31))","v":352},null,300,{"$f":"IF(SUM(K31,L31)=0,\"\",SUM(K31,L31))","v":300},null,357,{"$f":"IF(SUM(N31,O31)=0,\"\",SUM(N31,O31))","v":357},null,334,{"$f":"IF(SUM(Q31,R31)=0,\"\",SUM(Q31,R31))","v":334},null,264,{"$f":"IF(SUM(T31,U31)=0,\"\",SUM(T31,U31))","v":264},null,301,{"$f":"IF(SUM(W31,X31)=0,\"\",SUM(W31,X31))","v":301},null,104,{"$f":"IF(SUM(Z31,AA31)=0,\"\",SUM(Z31,AA31))","v":104},null,328,{"$f":"IF(SUM(AC31,AD31)=0,\"\",SUM(AC31,AD31))","v":328},{"$f":"IF(SUM(B31,E31,H31,K31,N31,Q31,T31,W31,Z31,AC31)=0,\"\",SUM(B31,E31,H31,K31,N31,Q31,T31,W31,Z31,AC31))","v":""},{"$f":"IF(SUM(C31,F31,I31,L31,O31,R31,U31,X31,AA31,AD31)=0,\"\",SUM(C31,F31,I31,L31,O31,R31,U31,X31,AA31,AD31))","v":3324}]
[{"$f":"IF(MATRICULA!B18=0,\"\",MATRICULA!B18)","v":"Particulares"},null,74,{"$f":"IF(SUM(B32,C32)=0,\"\",SUM(B32,C32))","v":74},null,129,{"$f":"IF(SUM(E32,F32)=0,\"\",SUM(E32,F32))","v":129},null,91,{"$f":"IF(SUM(H32,I32)=0,\"\",SUM(H32,I32))","v":91},null,53,{"$f":"IF(SUM(K32,L32)=0,\"\",SUM(K32,L32))","v":53},null,42,{"$f":"IF(SUM(N32,O32)=0,\"\",SUM(N32,O32))","v":42},null,92,{"$f":"IF(SUM(Q32,R32)=0,\"\",SUM(Q32,R32))","v":92},null,53,{"$f":"IF(SUM(T32,U32)=0,\"\",SUM(T32,U32))","v":53},null,54,{"$f":"IF(SUM(W32,X32)=0,\"\",SUM(W32,X32))","v":54},null,31,{"$f":"IF(SUM(Z32,AA32)=0,\"\",SUM(Z32,AA32))","v":31},null,39,{"$f":"IF(SUM(AC32,AD32)=0,\"\",SUM(AC32,AD32))","v":39},{"$f":"IF(SUM(B32,E32,H32,K32,N32,Q32,T32,W32,Z32,AC32)=0,\"\",SUM(B32,E32,H32,K32,N32,Q32,T32,W32,Z32,AC32))","v":""},{"$f":"IF(SUM(C32,F32,I32,L32,O32,R32,U32,X32,AA32,AD32)=0,\"\",SUM(C32,F32,I32,L32,O32,R32,U32,X32,AA32,AD32))","v":658}]
[{"$f":"IF(MATRICULA!B19=0,\"\",MATRICULA!B19)","v":"Secundaria Técnica"},null,563,563,null,484,484,null,610,610,null,617,617,null,722,722,null,591,591,null,627,627,null,439,439,null,243,243,null,494,494,"",5390]
[{"$f":"IF(MATRICULA!B20=0,\"\",MATRICULA!B20)","v":"Telesecundaria"},null,166,166,null,179,179,null,192,192,null,168,168,null,189,189,null,176,176,null,154,154,null,141,141,null,175,175,null,141,141,"",1681]
[{"$f":"IF(MATRICULA!B21=0,\"\",MATRICULA!B21)","v":""},null,null,"",null,null,"",null,null,"",null,null,"",null,null,"",null,null,"",null,null,"",null,null,"",null,null,"",null,null,"","",""]
[{"$f":"IF(MATRICULA!B22=0,\"\",MATRICULA!B22)","v":""},null,null,"",null,null,"",null,null,"",null,null,"",null,null,"",null,null,"",null,null,"",null,null,"",null,null,"",null,null,"","",""]
[{"$f":"IF(MATRICULA!B23=0,\"\",MATRICULA!B23)","v":""},null,null,"",null,null,"",null,null,"",null,null,"",null,null,"",null,null,"",null,null,"",null,null,"",null,null,"",null,null,"","",""]
[{"$f":"IF(MATRICULA!B24=0,\"\",MATRICULA!B24)","v":""},null,null,{"$f":"IF(SUM(B38,C38)=0,\"\",SUM(B38,C38))","v":""},null,null,{"$f":"IF(SUM(E38,F38)=0,\"\",SUM(E38,F38))","v":""},null,null,{"$f":"IF(SUM(H38,I38)=0,\"\",SUM(H38,I38))","v":""},null,null,{"$f":"IF(SUM(K38,L38)=0,\"\",SUM(K38,L38))","v":""},null,null,{"$f":"IF(SUM(N38,O38)=0,\"\",SUM(N38,O38))","v":""},null,null,{"$f":"IF(SUM(Q38,R38)=0,\"\",SUM(Q38,R38))","v":""},null,null,{"$f":"IF(SUM(T38,U38)=0,\"\",SUM(T38,U38))","v":""},null,null,{"$f":"IF(SUM(W38,X38)=0,\"\",SUM(W38,X38))","v":""},null,null,{"$f":"IF(SUM(Z38,AA38)=0,\"\",SUM(Z38,AA38))","v":""},null,null,{"$f":"IF(SUM(AC38,AD38)=0,\"\",SUM(AC38,AD38))","v":""},{"$f":"IF(SUM(B38,E38,H38,K38,N38,Q38,T38,W38,Z38,AC38)=0,\"\",SUM(B38,E38,H38,K38,N38,Q38,T38,W38,Z38,AC38))","v":""},{"$f":"IF(SUM(C38,F38,I38,L38,O38,R38,U38,X38,AA38,AD38)=0,\"\",SUM(C38,F38,I38,L38,O38,R38,U38,X38,AA38,AD38))","v":""}]
[{"$f":"IF(MATRICULA!B25=0,\"\",MATRICULA!B25)","v":""},null,null,{"$f":"IF(SUM(B39,C39)=0,\"\",SUM(B39,C39))","v":""},null,null,{"$f":"IF(SUM(E39,F39)=0,\"\",SUM(E39,F39))","v":""},null,null,{"$f":"IF(SUM(H39,I39)=0,\"\",SUM(H39,I39))","v":""},null,null,{"$f":"IF(SUM(K39,L39)=0,\"\",SUM(K39,L39))","v":""},null,null,{"$f":"IF(SUM(N39,O39)=0,\"\",SUM(N39,O39))","v":""},null,null,{"$f":"IF(SUM(Q39,R39)=0,\"\",SUM(Q39,R39))","v":""},null,null,{"$f":"IF(SUM(T39,U39)=0,\"\",SUM(T39,U39))","v":""},null,null,{"$f":"IF(SUM(W39,X39)=0,\"\",SUM(W39,X39))","v":""},null,null,{"$f":"IF(SUM(Z39,AA39)=0,\"\",SUM(Z39,AA39))","v":""},null,null,{"$f":"IF(SUM(AC39,AD39)=0,\"\",SUM(AC39,AD39))","v":""},{"$f":"IF(SUM(B39,E39,H39,K39,N39,Q39,T39,W39,Z39,AC39)=0,\"\",SUM(B39,E39,H39,K39,N39,Q39,T39,W39,Z39,AC39))","v":""},{"$f":"IF(SUM(C39,F39,I39,L39,O39,R39,U39,X39,AA39,AD39)=0,\"\",SUM(C39,F39,I39,L39,O39,R39,U39,X39,AA39,AD39))","v":""}]
[{"$f":"IF(MATRICULA!B26=0,\"\",MATRICULA!B26)","v":""},null,null,"",null,null,"",null,null,"",null,null,"",null,null,"",null,null,"",null,null,"",null,null,"",null,null,"",null,null,"","",""]
["Total",{"$f":"IF(SUM(B31:B40)=0,\"\",SUM(B31:B40))","v":""},1142,1142,"",1437,1437,"",1245,1245,"",1138,1138,"",1310,1310,"",1193,1193,"",1098,1098,"",935,935,"",553,553,"",1002,1002,"",11053]
[]
["Nota: Para las columnas \"Campos de Formación Académica y Áreas de Desarrollo Personal y Social en riesgo de no acreditar\" registre la cantidad de cincos o seis que existen en cada campo o área."]

{"sheet":"PARTICIPACIÓN 1","index":2,"n_rows":27,"n_cols":31,"rows_kept":27,"cut":false,"hidden":false,"merged":[[26,19,26,22],[19,3,19,6],[20,3,20,6],[21,3,21,6],[22,3,22,6],[23,3,23,6],[24,3,24,6],[25,3,25,6],[26,3,26,6],[26,11,26,14],[19,19,19,22],[20,19,20,22],[21,19,21,22],[22,19,22,22],[23,19,23,22],[24,19,24,22],[25,19,25,22],[25,11,25,14],[25,27,25,29],[26,27,26,29],[14,27,15,29],[14,3,15,6],[14,11,15,14],[23,15,23,18],[24,0,24,2],[24,7,24,10],[24,15,24,18],[24,23,24,26],[17,23,17,26],[14,19,15,22],[16,19,16,22],[16,3,16,6],[26,23,26,26],[16,11,16,14],[17,11,17,14],[18,11,18,14],[19,11,19,14],[20,11,20,14],[21,11,21,14],[22,11,22,14],[23,11,23,14],[24,11,24,14],[24,30,24,32],[20,30,20,32],[19,0,19,2],[19,7,19,10],[19,15,19,18],[19,23,19,26],[19,30,19,32],[19,27,19,29],[21,27,21,29],[22,27,22,29],[20,27,20,29],[21,0,21,2],[21,7,21,10],[21,15,21,18],[20,0,20,2],[20,7,20,10],[20,15,20,18],[20,23,20,26],[23,27,23,29],[24,27,24,29],[17,30,17,32],[18,0,18,2],[18,23,18,26],[18,30,18,32],[17,0,17,2],[17,7,17,10],[17,15,17,18],[17,27,17,29],[18,27,18,29],[18,7,18,10],[18,15,18,18],[17,19,17,22],[18,19,18,22],[17,3,17,6],[18,3,18,6],[7,13,7,25],[0,0,0,32],[2,1,2,30],[3,1,3,30],[4,1,4,30],[5,1,5,30],[6,13,6,25],[6,1,6,11],[7,1,7,11],[11,7,11,25],[16,0,16,2],[16,7,16,10],[16,15,16,18],[16,23,16,26],[16,30,16,32],[16,27,16,29],[14,30,15,32],[14,23,15,26],[14,15,15,18],[14,7,15,10],[14,0,15,2],[26,30,26,32],[10,0,10,5],[26,0,26,2],[26,7,26,10],[26,15,26,18],[23,23,23,26],[23,30,23,32],[25,0,25,2],[25,7,25,10],[25,15,25,18],[25,23,25,26],[25,30,25,32],[23,0,23,2],[23,7,23,10],[21,23,21,26],[21,30,21,32],[22,0,22,2],[22,7,22,10],[22,15,22,18],[22,23,22,26],[22,30,22,32],[13,0,13,32],[10,7,10,25],[11,0,11,2]]}
[]
[]
[null,"Secretaría de Educación Pública del Estado de Baja California Sur"]
[null,"Dirección de Educación Secundaria"]
[null,"NIVELES DE COMUNICACIÓN Y PARTICIPACIÓN DE ALUMNOS"]
[null,"PRIMER GRADO "]
[null,"PERIODO EVALUACIÓN:",null,null,null,null,null,null,null,null,null,null,null,{"$f":"IF('APROV 1'!N7:Z7<>0,'APROV 1'!N7:Z7, \"\")","v":"2DO TRIMESTRE"}]
[null,"CICLO ESCOLAR :",null,null,null,null,null,null,null,null,null,null,null,{"$f":"IF('APROV 1'!N8:Z8<>0, 'APROV 1'!N8:Z8, \"\")","v":"2021-2022"}]
[]
[]
["DIRECCIÓN: ",null,null,null,null,null,null,"EDUCACIÓN SECUNDARIA"]
["DIRECTORA:",null,null,null,null,null,null,"MTRA. OFELIA ELIZABETH OCHOA ROMERO"]
[]
[" COMUNICACIÓN Y PARTICIPACIÓN CON ALUMNOS  (Registrar cantidad de alumnos)"]
["Modalidad",null,null,"COMUNICACIÓN Y PARTICIPACIÓN SOSTENIDA",null,null,null,"%",null,null,null,"COMUNICACIÓN Y PARTICIPACIÓN INTERMITENTE",null,null,null,"%",null,null,null,"COMUNICACIÓN PRACTICAMENTE INEXISTENTE",null,null,null,"%",null,null,null,"TOTAL",null,null,"MATRÍCULA\nEXISTENCIA"]
[]
[{"$f":"IF(MATRICULA!B17=0,\"\",MATRICULA!B17)","v":"Generales Públicas"},null,null,4591,null,null,null,{"$f":"IFERROR((D17+E17+F17)/AE17*100,\"\")","v":83.701002734731091},null,null,null,807,null,null,null,{"$f":"IFERROR((L17+M17+N17)/AE17*100,\"\")","v":14.71285323609845},null,null,null,87,null,null,null,{"$f":"IFERROR((T17+U17+V17)/AE17*100,\"\")","v":1.5861440291704647},null,null,null,{"$f":"IF(SUM(D17:G17,L17:O17,T17:W17)=0,\"\",SUM(D17:G17,L17:O17,T17:W17))","v":5485},null,null,{"$f":"IF(MATRICULA!AC33=0,\"\",MATRICULA!AC33)","v":5485}]
[{"$f":"IF(MATRICULA!B18=0,\"\",MATRICULA!B18)","v":"Particulares"},null,null,1214,null,null,null,{"$f":"IFERROR((D18+E18+F18)/AE18*100,\"\")","v":98.538961038961034},null,null,null,18,null,null,null,{"$f":"IFERROR((L18+M18+N18)/AE18*100,\"\")","v":1.4610389610389609},null,null,null,0,null,null,null,{"$f":"IFERROR((T18+U18+V18)/AE18*100,\"\")","v":0},null,null,null,{"$f":"IF(SUM(D18:G18,L18:O18,T18:W18)=0,\"\",SUM(D18:G18,L18:O18,T18:W18))","v":1232},null,null,{"$f":"IF(MATRICULA!AC34=0,\"\",MATRICULA!AC34)","v":1232}]
[{"$f":"IF(MATRICULA!B19=0,\"\",MATRICULA!B19)","v":"Secundaria Técnica"},null,null,4315,null,null,null,84.790725093338565,null,null,null,720,null,null,null,14.148162703871096,null,null,null,54,null,null,null,1.0611122027903321,null,null,null,5089,null,null,{"$f":"IF(MATRICULA!AC35=0,\"\",MATRICULA!AC35)","v":5089}]
[{"$f":"IF(MATRICULA!B20=0,\"\",MATRICULA!B20)","v":"Telesecundaria"},null,null,1576,null,null,null,89.698349459305632,null,null,null,151,null,null,null,8.5941946499715431,null,null,null,30,null,null,null,1.707455890722823,null,null,null,1757,null,null,{"$f":"IF(MATRICULA!AC36=0,\"\",MATRICULA!AC36)","v":1757}]
[{"$f":"IF(MATRICULA!B21=0,\"\",MATRICULA!B21)","v":""},null,null,null,null,null,null,"",null,null,null,null,null,null,null,"",null,null,null,null,null,null,null,"",null,null,null,"",null,null,{"$f":"IF(MATRICULA!AC37=0,\"\",MATRICULA!AC37)","v":""}]
[{"$f":"IF(MATRICULA!B22=0,\"\",MATRICULA!B22)","v":""},null,null,null,null,null,null,"",null,null,null,null,null,null,null,"",null,null,null,null,null,null,null,"",null,null,null,"",null,null,{"$f":"IF(MATRICULA!AC38=0,\"\",MATRICULA!AC38)","v":""}]
[{"$f":"IF(MATRICULA!B23=0,\"\",MATRICULA!B23)","v":""},null,null,null,null,null,null,"",null,null,null,null,null,null,null,"",null,null,null,null,null,null,null,"",null,null,null,"",null,null,{"$f":"IF(MATRICULA!AC39=0,\"\",MATRICULA!AC39)","v":""}]
[{"$f":"IF(MATRICULA!B24=0,\"\",MATRICULA!B24)","v":""},null,null,null,null,null,null,"",null,null,null,null,null,null,null,"",null,null,null,null,null,null,null,"",null,null,null,"",null,null,{"$f":"IF(MATRICULA!AC40=0,\"\",MATRICULA!AC40)","v":""}]
[{"$f":"IF(MATRICULA!B25=0,\"\",MATRICULA!B25)","v":""},null,null,null,null,null,null,"",null,null,null,null,null,null,null,"",null,null,null,null,null,null,null,"",null,null,null,"",null,null,{"$f":"IF(MATRICULA!AC41=0,\"\",MATRICULA!AC41)","v":""}]
[{"$f":"IF(MATRICULA!B26=0,\"\",MATRICULA!B26)","v":""},null,null,null,null,null,null,"",null,null,null,null,null,null,null,"",null,null,null,null,null,null,null,"",null,null,null,"",null,null,{"$f":"IF(MATRICULA!AC42=0,\"\",MATRICULA!AC42)","v":""}]
["TOTAL",null,null,{"$f":"SUM(D17:D26)","v":11696},null,null,null,86.234608862346079,null,null,null,{"$f":"SUM(L17:L26)","v":1696},null,null,null,12.504608125046083,null,null,null,{"$f":"SUM(T17:T26)","v":171},null,null,null,1.2607830126078301,null,null,null,{"$f":"SUM(AB17:AD26)","v":13563},null,null,{"$f":"SUM(AE17:AG26)","v":13563}]

{"sheet":"Gráfica APROV 1","index":3,"n_rows":18,"n_cols":14,"rows_kept":18,"cut":false,"hidden":false,"merged":[[5,13,5,25],[6,13,6,25],[9,0,9,5],[9,7,9,25],[0,0,0,32],[2,1,2,29],[3,1,3,29],[4,1,4,29],[5,1,5,12],[33,0,47,32],[10,26,10,30],[10,0,10,2],[10,7,10,25],[6,1,6,12]]}
[]
[]
[null,"Secretaría de Educación Pública del Estado de Baja California Sur"]
[null,"Dirección de Educación Secundaria"]
[null,"PRIMER GRADO "]
[null,"PERIODO EVALUACIÓN:",null,null,null,null,null,null,null,null,null,null,null,{"$f":"IF('APROV 1'!N7:Z7<>0,'APROV 1'!N7:Z7, \"\")","v":"2DO TRIMESTRE"}]
[null,"CICLO ESCOLAR :",null,null,null,null,null,null,null,null,null,null,null,{"$f":"IF('APROV 1'!N8:Z8<>0, 'APROV 1'!N8:Z8, \"\")","v":"2021-2022"}]
[]
[]
["DIRECCIÓN: ",null,null,null,null,null,null,"EDUCACIÓN SECUNDARIA"]
["DIRECTORA:",null,null,null,null,null,null,"MTRA. OFELIA ELIZABETH OCHOA ROMERO"]
[]
[]
[]
[]
[]
[null,"Lengua Materna","Matemáticas","Inglés","Ciencias y tecnología (Biología)","Historia","Geografía","Formación Cívica y Ética","Tecnología I","Educación Física","Artes"]
[null,{"$f":"'APROV 1'!B26:D26","v":8.5},{"$f":"'APROV 1'!E26","v":8.3000000000000007},{"$f":"'APROV 1'!H26","v":8.5},{"$f":"'APROV 1'!K26","v":8.6},{"$f":"'APROV 1'!N26","v":8.5},{"$f":"'APROV 1'!Q26","v":8.5},{"$f":"'APROV 1'!T26","v":8.6999999999999993},{"$f":"'APROV 1'!W26","v":8.9},{"$f":"'APROV 1'!Z26","v":9.3000000000000007},{"$f":"'APROV 1'!AC26","v":9}]

{"sheet":"Gráfica PART 1","index":4,"n_rows":14,"n_cols":14,"rows_kept":14,"cut":false,"hidden":false,"merged":[[9,0,9,5],[9,7,9,25],[10,7,10,25],[10,26,10,30],[0,0,0,32],[2,1,2,29],[3,1,3,29],[4,1,4,29],[5,1,5,12],[5,13,5,25],[6,1,6,12],[6,13,6,25],[10,0,10,2]]}
[]
[]
[null,"Secretaría de Educación Pública del Estado de Baja California Sur"]
[null,"Dirección de Educación Secundaria"]
[null,"PRIMER GRADO "]
[null,"PERIODO EVALUACIÓN:",null,null,null,null,null,null,null,null,null,null,null,{"$f":"IF('APROV 1'!N7:Z7<>0,'APROV 1'!N7:Z7, \"\")","v":"2DO TRIMESTRE"}]
[null,"CICLO ESCOLAR :",null,null,null,null,null,null,null,null,null,null,null,{"$f":"IF('APROV 1'!N8:Z8<>0, 'APROV 1'!N8:Z8, \"\")","v":"2021-2022"}]
[]
[]
["DIRECCIÓN: ",null,null,null,null,null,null,"EDUCACIÓN SECUNDARIA"]
["DIRECTORA:",null,null,null,null,null,null,"MTRA. OFELIA ELIZABETH OCHOA ROMERO"]
[]
[null,null,null,"COMUNICACIÓN Y PARTICIPACIÓN SOSTENIDA","COMUNICACIÓN Y PARTICIPACIÓN INTERMITENTE","COMUNICACIÓN PRACTICAMENTE INEXISTENTE"]
[null,null,null,{"$f":"'PARTICIPACIÓN 1'!H27/100","v":0.86234608862346074},{"$f":"'PARTICIPACIÓN 1'!P27/100","v":0.12504608125046082},{"$f":"'PARTICIPACIÓN 1'!X27/100","v":1.2607830126078301E-2}]

{"sheet":"APROV 2","index":5,"n_rows":44,"n_cols":30,"rows_kept":44,"cut":false,"hidden":false,"merged":[[13,0,13,21],[29,19,29,21],[28,0,28,21],[14,22,14,24],[15,22,15,24],[11,4,11,10],[11,12,11,13],[23,7,23,9],[24,7,24,9],[25,7,25,9],[23,13,23,15],[24,13,24,15],[25,13,25,15],[15,4,15,6],[23,4,23,6],[24,4,24,6],[25,4,25,6],[15,1,15,3],[16,4,16,6],[18,1,18,3],[18,4,18,6],[20,1,20,3],[20,4,20,6],[22,1,22,3],[25,1,25,3],[29,13,29,15],[29,25,29,27],[21,1,21,3],[21,4,21,6],[21,7,21,9],[22,7,22,9],[20,7,20,9],[20,10,20,12],[20,13,20,15],[20,16,20,18],[26,19,26,21],[22,4,22,6],[23,1,23,3],[24,1,24,3],[23,10,23,12],[24,10,24,12],[25,10,25,12],[22,25,22,27],[19,1,19,3],[19,4,19,6],[19,7,19,9],[19,10,19,12],[19,13,19,15],[2,1,2,26],[3,1,3,26],[4,1,4,26],[5,1,5,26],[10,0,10,2],[6,13,6,23],[7,13,7,23],[6,1,6,12],[7,1,7,12],[9,0,9,5],[9,7,9,25],[10,7,10,25],[10,26,10,30],[15,28,15,29],[14,16,14,18],[15,10,15,12],[14,10,14,12],[14,13,14,15],[19,28,19,29],[43,0,44,29],[26,13,26,15],[26,25,26,27],[26,16,26,18],[26,1,26,3],[29,28,29,29],[26,28,26,29],[26,4,26,6],[26,7,26,9],[29,0,30,0],[29,1,29,3],[29,4,29,6],[29,7,29,9],[29,16,29,18],[29,22,29,24],[29,10,29,12],[26,22,26,24],[26,10,26,12],[23,28,23,29],[24,28,24,29],[25,28,25,29],[23,16,23,18],[24,16,24,18],[25,16,25,18],[23,19,23,21],[24,19,24,21],[25,19,25,21],[25,22,25,24],[23,22,23,24],[24,22,24,24],[20,28,20,29],[21,28,21,29],[22,28,22,29],[13,22,13,27],[16,10,16,12],[16,13,16,15],[16,16,16,18],[16,19,16,21],[16,22,16,24],[16,25,16,27],[20,19,20,21],[20,22,20,24],[20,25,20,27],[21,10,21,12],[21,13,21,15],[21,16,21,18],[21,19,21,21],[21,22,21,24],[21,25,21,27],[22,10,22,12],[22,13,22,15],[22,16,22,18],[22,19,22,21],[22,22,22,24],[13,28,13,29],[28,22,28,27],[28,28,28,29],[45,0,56,29],[15,7,15,9],[14,19,14,21],[15,13,15,15],[15,16,15,18],[15,19,15,21],[14,28,14,29],[14,0,15,0],[14,1,14,3],[14,4,14,6],[14,7,14,9],[14,25,14,27],[15,25,15,27],[23,25,23,27],[24,25,24,27],[25,25,25,27],[16,1,16,3],[16,7,16,9],[16,28,16,29],[17,1,17,3],[17,4,17,6],[17,28,17,29],[18,7,18,9],[18,10,18,12],[18,13,18,15],[18,16,18,18],[18,19,18,21],[18,22,18,24],[18,25,18,27],[18,28,18,29],[19,16,19,18],[19,19,19,21],[19,22,19,24],[19,25,19,27],[17,7,17,9],[17,10,17,12],[17,13,17,15],[17,16,17,18],[17,19,17,21],[17,22,17,24],[17,25,17,27]]}
[]
[]
[null,"Secretaría de Educación Pública del Estado de Baja California Sur"]
[null,"Dirección de Educación Secundaria"]
[null,"APROVECHAMIENTO Y RIESGO DE NO ACREDITAR"]
[null,"SEGUNDO GRADO"]
[null,"PERIODO EVALUACIÓN:",null,null,null,null,null,null,null,null,null,null,null,{"$f":"IF('APROV 1'!N7:Z7<>0,'APROV 1'!N7:Z7, \"\")","v":"2DO TRIMESTRE"}]
[null,"CICLO ESCOLAR :",null,null,null,null,null,null,null,null,null,null,null,{"$f":"IF('APROV 1'!N8:Z8<>0, 'APROV 1'!N8:Z8, \"\")","v":"2021-2022"}]
[]
["DIRECCIÓN: ",null,null,null,null,null,null,"EDUCACIÓN SECUNDARIA"]
["DIRECTORA:",null,null,null,null,null,null,"MTRA. OFELIA ELIZABETH OCHOA ROMERO"]
[]
[]
["Promedio de Aprovechamiento de los Campos de Formación Académica",null,null,null,null,null,null,null,null,null,null,null,null,null,null,null,null,null,null,null,null,null,"Promedio de Aprovechamiento de las Áreas de Desarrollo Personal y Social"]
["Modalidad","Lengua Materna",null,null,"Matemáticas",null,null,"Inglés",null,null,"Ciencias y tecnología (Física)",null,null,"Historia ",null,null,"Formación Cívica y Ética",null,null,"Tecnología II",null,null,"Educación Física",null,null,"Artes",null,null,"Prom. Final"]
[null,"CALIF",null,null,"CALIF",null,null,"CALIF",null,null,"CALIF",null,null,"CALIF",null,null,"CALIF",null,null,"CALIF",null,null,"CALIF",null,null,"CALIF",null,null,"CALIF"]
[{"$f":"IF(MATRICULA!B17=0,\"\",MATRICULA!B17)","v":"Generales Públicas"},8.5,null,null,8.4,null,null,8.6999999999999993,null,null,8.6,null,null,8.6999999999999993,null,null,8.8000000000000007,null,null,8.9,null,null,9.1999999999999993,null,null,8.9,null,null,{"$f":"IFERROR(ROUND(AVERAGE(B17:AB17),1),\"\")","v":8.6999999999999993}]
[{"$f":"IF(MATRICULA!B18=0,\"\",MATRICULA!B18)","v":"Particulares"},8.6999999999999993,null,null,8.5,null,null,8.6,null,null,8.5,null,null,8.6999999999999993,null,null,8.9,null,null,9.1,null,null,9.5,null,null,9.3000000000000007,null,null,8.9]
[{"$f":"IF(MATRICULA!B19=0,\"\",MATRICULA!B19)","v":"Secundaria Técnica"},8.5,null,null,8.4,null,null,8.5,null,null,8.5,null,null,8.6,null,null,8.5,null,null,8.8000000000000007,null,null,9.1,null,null,8.8000000000000007,null,null,{"$f":"IFERROR(ROUND(AVERAGE(B19:AB19),1),\"\")","v":8.6}]
[{"$f":"IF(MATRICULA!B20=0,\"\",MATRICULA!B20)","v":"Telesecundaria"},8.4,null,null,8.3000000000000007,null,null,8.4,null,null,8.4,null,null,8.4,null,null,8.8000000000000007,null,null,9,null,null,9.1999999999999993,null,null,9.1,null,null,8.6999999999999993]
[{"$f":"IF(MATRICULA!B21=0,\"\",MATRICULA!B21)","v":""},null,null,null,null,null,null,null,null,null,null,null,null,null,null,null,null,null,null,null,null,null,null,null,null,null,null,null,""]
[{"$f":"IF(MATRICULA!B22=0,\"\",MATRICULA!B22)","v":""},null,null,null,null,null,null,null,null,null,null,null,null,null,null,null,null,null,null,null,null,null,null,null,null,null,null,null,""]
[{"$f":"IF(MATRICULA!B23=0,\"\",MATRICULA!B23)","v":""},null,null,null,null,null,null,null,null,null,null,null,null,null,null,null,null,null,null,null,null,null,null,null,null,null,null,null,""]
[{"$f":"IF(MATRICULA!B24=0,\"\",MATRICULA!B24)","v":""},null,null,null,null,null,null,null,null,null,null,null,null,null,null,null,null,null,null,null,null,null,null,null,null,null,null,null,{"$f":"IFERROR(ROUND(AVERAGE(B24:AB24),1),\"\")","v":""}]
[{"$f":"IF(MATRICULA!B25=0,\"\",MATRICULA!B25)","v":""},null,null,null,null,null,null,null,null,null,null,null,null,null,null,null,null,null,null,null,null,null,null,null,null,null,null,null,""]
[{"$f":"IF(MATRICULA!B26=0,\"\",MATRICULA!B26)","v":""},null,null,null,null,null,null,null,null,null,null,null,null,null,null,null,null,null,null,null,null,null,null,null,null,null,null,null,""]
["Gral.",{"$f":"IFERROR(ROUND(AVERAGE(B17:D26),1),\"\")","v":8.5},null,null,{"$f":"IFERROR(ROUND(AVERAGE(E17:G26),1),\"\")","v":8.4},null,null,{"$f":"IFERROR(ROUND(AVERAGE(H17:J26),1),\"\")","v":8.6},null,null,{"$f":"IFERROR(ROUND(AVERAGE(K17:M26),1),\"\")","v":8.5},null,null,{"$f":"IFERROR(ROUND(AVERAGE(N17:P26),1),\"\")","v":8.6},null,null,{"$f":"IFERROR(ROUND(AVERAGE(Q17:S26),1),\"\")","v":8.8000000000000007},null,null,{"$f":"IFERROR(ROUND(AVERAGE(T17:V26),1),\"\")","v":9},null,null,{"$f":"IFERROR(ROUND(AVERAGE(W17:Y26),1),\"\")","v":9.3000000000000007},null,null,{"$f":"IFERROR(ROUND(AVERAGE(Z17:AB26),1),\"\")","v":9},null,null,{"$f":"IFERROR(ROUND(AVERAGE(AC17:AD26),1),\"\")","v":8.6999999999999993}]
[]
["Campos de Formación Académica en situacion de riesgo de no acreditar",null,null,null,null,null,null,null,null,null,null,null,null,null,null,null,null,null,null,null,null,null,"Áreas de Desarrollo Personal y Social en situación de riesgo de no acreditar"]
["Modalidad","Lengua Materna",null,null,"Matemáticas",null,null,"Inglés",null,null,"Ciencias y tecnología (Física)",null,null,"Historia ",null,null,"Formación Cívica y Ética",null,null,"Tecnología II",null,null,"Educación Física",null,null,"Artes",null,null,"Total"]
[null,5,6,"T",5,6,"T",5,6,"T",5,6,"T",5,6,"T",5,6,"T",5,6,"T",5,6,"T",5,6,"T",5,6]
[{"$f":"IF(MATRICULA!B17=0,\"\",MATRICULA!B17)","v":"Generales Públicas"},null,262,{"$f":"IF(SUM(B32,C32)=0,\"\",SUM(B32,C32))","v":262},null,420,{"$f":"IF(SUM(E32,F32)=0,\"\",SUM(E32,F32))","v":420},null,346,{"$f":"IF(SUM(H32,I32)=0,\"\",SUM(H32,I32))","v":346},null,394,{"$f":"IF(SUM(K32,L32)=0,\"\",SUM(K32,L32))","v":394},null,398,{"$f":"IF(SUM(N32,O32)=0,\"\",SUM(N32,O32))","v":398},null,259,{"$f":"IF(SUM(Q32,R32)=0,\"\",SUM(Q32,R32))","v":259},null,248,{"$f":"IF(SUM(T32,U32)=0,\"\",SUM(T32,U32))","v":248},null,97,{"$f":"IF(SUM(W32,X32)=0,\"\",SUM(W32,X32))","v":97},null,294,{"$f":"IF(SUM(Z32,AA32)=0,\"\",SUM(Z32,AA32))","v":294},{"$f":"IF(SUM(B32,E32,H32,K32,N32,Q32,T32,W32,Z32)=0,\"\",SUM(B32,E32,H32,K32,N32,Q32,T32,W32,Z32))","v":""},{"$f":"IF(SUM(C32,F32,I32,L32,O32,R32,U32,X32,AA32)=0,\"\",SUM(C32,F32,I32,L32,O32,R32,U32,X32,AA32))","v":2718}]
[{"$f":"IF(MATRICULA!B18=0,\"\",MATRICULA!B18)","v":"Particulares"},null,56,56,null,112,112,null,68,68,null,68,68,null,50,50,null,42,42,null,65,65,null,28,28,null,47,47,"",536]
[{"$f":"IF(MATRICULA!B19=0,\"\",MATRICULA!B19)","v":"Secundaria Técnica"},null,507,507,null,534,534,null,480,480,null,452,452,null,493,493,null,607,607,null,376,376,null,209,209,null,378,378,"",4036]
[{"$f":"IF(MATRICULA!B20=0,\"\",MATRICULA!B20)","v":"Telesecundaria"},null,143,143,null,140,140,null,151,151,null,140,140,null,148,148,null,118,118,null,105,105,null,97,97,null,103,103,"",1145]
[{"$f":"IF(MATRICULA!B21=0,\"\",MATRICULA!B21)","v":""},null,null,"",null,null,"",null,null,"",null,null,"",null,null,"",null,null,"",null,null,"",null,null,"",null,null,"","",""]
[{"$f":"IF(MATRICULA!B22=0,\"\",MATRICULA!B22)","v":""},null,null,"",null,null,"",null,null,"",null,null,"",null,null,"",null,null,"",null,null,"",null,null,"",null,null,"","",""]
[{"$f":"IF(MATRICULA!B23=0,\"\",MATRICULA!B23)","v":""},null,null,"",null,null,"",null,null,"",null,null,"",null,null,"",null,null,"",null,null,"",null,null,"",null,null,"","",""]
[{"$f":"IF(MATRICULA!B24=0,\"\",MATRICULA!B24)","v":""},null,null,{"$f":"IF(SUM(B39,C39)=0,\"\",SUM(B39,C39))","v":""},null,null,{"$f":"IF(SUM(E39,F39)=0,\"\",SUM(E39,F39))","v":""},null,null,{"$f":"IF(SUM(H39,I39)=0,\"\",SUM(H39,I39))","v":""},null,null,{"$f":"IF(SUM(K39,L39)=0,\"\",SUM(K39,L39))","v":""},null,null,{"$f":"IF(SUM(N39,O39)=0,\"\",SUM(N39,O39))","v":""},null,null,{"$f":"IF(SUM(Q39,R39)=0,\"\",SUM(Q39,R39))","v":""},null,null,{"$f":"IF(SUM(T39,U39)=0,\"\",SUM(T39,U39))","v":""},null,null,{"$f":"IF(SUM(W39,X39)=0,\"\",SUM(W39,X39))","v":""},null,null,{"$f":"IF(SUM(Z39,AA39)=0,\"\",SUM(Z39,AA39))","v":""},{"$f":"IF(SUM(B39,E39,H39,K39,N39,Q39,T39,W39,Z39)=0,\"\",SUM(B39,E39,H39,K39,N39,Q39,T39,W39,Z39))","v":""},""]
[{"$f":"IF(MATRICULA!B25=0,\"\",MATRICULA!B25)","v":""},null,null,"",null,null,"",null,null,"",null,null,"",null,null,"",null,null,"",null,null,"",null,null,"",null,null,"","",""]
[{"$f":"IF(MATRICULA!B26=0,\"\",MATRICULA!B26)","v":""},null,null,"",null,null,"",null,null,"",null,null,"",null,null,"",null,null,"",null,null,"",null,null,"",null,null,"","",""]
["Total",{"$f":"IF(SUM(B32:B41)=0,\"\",SUM(B32:B41))","v":""},968,968,"",1206,1206,"",1045,1045,"",1054,1054,"",1089,1089,"",1026,1026,"",794,794,"",431,431,"",822,822,"",8435]
[]
["Nota: Para las columnas \"Campos de Formación Académica y Áreas de Desarrollo Personal y Social en riesgo de no acreditar\" registre la cantidad de cincos o seis que existen en cada campo o área."]

{"sheet":"PARTICIPACIÓN 2","index":6,"n_rows":27,"n_cols":31,"rows_kept":27,"cut":false,"hidden":false,"merged":[[25,3,25,6],[26,3,26,6],[26,11,26,14],[26,19,26,22],[23,19,23,22],[24,19,24,22],[25,19,25,22],[25,11,25,14],[10,7,10,25],[11,7,11,25],[23,23,23,26],[20,23,20,26],[18,23,18,26],[13,0,13,32],[14,0,15,2],[14,7,15,10],[14,15,15,18],[14,23,15,26],[14,30,15,32],[14,11,15,14],[14,19,15,22],[10,0,10,5],[11,0,11,2],[11,26,11,30],[25,27,25,29],[26,27,26,29],[14,27,15,29],[26,23,26,26],[26,30,26,32],[26,0,26,2],[26,7,26,10],[26,15,26,18],[24,23,24,26],[24,30,24,32],[25,0,25,2],[25,7,25,10],[25,15,25,18],[25,23,25,26],[25,30,25,32],[24,0,24,2],[14,3,15,6],[24,7,24,10],[24,15,24,18],[22,23,22,26],[22,30,22,32],[23,0,23,2],[23,7,23,10],[23,15,23,18],[23,30,23,32],[22,0,22,2],[22,7,22,10],[22,15,22,18],[22,27,22,29],[23,27,23,29],[24,27,24,29],[22,19,22,22],[22,11,22,14],[23,11,23,14],[24,11,24,14],[22,3,22,6],[23,3,23,6],[24,3,24,6],[20,30,20,32],[21,0,21,2],[21,7,21,10],[21,15,21,18],[21,23,21,26],[21,30,21,32],[20,0,20,2],[20,7,20,10],[20,15,20,18],[20,27,20,29],[21,27,21,29],[20,19,20,22],[21,19,21,22],[20,3,20,6],[21,3,21,6],[20,11,20,14],[21,11,21,14],[18,30,18,32],[19,0,19,2],[19,7,19,10],[19,15,19,18],[19,23,19,26],[19,30,19,32],[18,0,18,2],[18,7,18,10],[18,15,18,18],[18,27,18,29],[19,27,19,29],[18,19,18,22],[19,19,19,22],[18,3,18,6],[19,3,19,6],[18,11,18,14],[19,11,19,14],[16,0,16,2],[16,7,16,10],[16,15,16,18],[16,23,16,26],[16,30,16,32],[17,0,17,2],[17,7,17,10],[17,15,17,18],[17,23,17,26],[17,30,17,32],[16,27,16,29],[17,27,17,29],[16,19,16,22],[17,19,17,22],[16,3,16,6],[17,3,17,6],[16,11,16,14],[17,11,17,14],[0,0,0,32],[2,1,2,30],[3,1,3,30],[4,1,4,30],[5,1,5,30],[6,13,6,25],[7,13,7,25],[6,1,6,10],[7,1,7,10]]}
[]
[]
[null,"Secretaría de Educación Pública del Estado de Baja California Sur"]
[null,"Dirección de Educación Secundaria"]
[null,"NIVELES DE COMUNICACIÓN Y PARTICIPACIÓN DE ALUMNOS"]
[null,"SEGUNDO GRADO "]
[null,"PERIODO EVALUACIÓN:",null,null,null,null,null,null,null,null,null,null,null,{"$f":"IF('APROV 1'!N7:Z7<>0,'APROV 1'!N7:Z7, \"\")","v":"2DO TRIMESTRE"}]
[null,"CICLO ESCOLAR :",null,null,null,null,null,null,null,null,null,null,null,{"$f":"IF('APROV 1'!N8:Z8<>0, 'APROV 1'!N8:Z8, \"\")","v":"2021-2022"}]
[]
[]
["DIRECCIÓN: ",null,null,null,null,null,null,"EDUCACIÓN SECUNDARIA"]
["DIRECTORA:",null,null,null,null,null,null,"MTRA. OFELIA ELIZABETH OCHOA ROMERO"]
[]
[" COMUNICACIÓN Y PARTICIPACIÓN CON ALUMNOS  (Registrar cantidad de alumnos)"]
["Modalidad",null,null,"COMUNICACIÓN Y PARTICIPACIÓN SOSTENIDA",null,null,null,"%",null,null,null,"COMUNICACIÓN Y PARTICIPACIÓN INTERMITENTE",null,null,null,"%",null,null,null,"COMUNICACIÓN PRACTICAMENTE INEXISTENTE",null,null,null,"%",null,null,null,"TOTAL",null,null,"MATRÍCULA\nEXISTENCIA"]
[]
[{"$f":"IF(MATRICULA!B17=0,\"\",MATRICULA!B17)","v":"Generales Públicas"},null,null,4743,null,null,null,{"$f":"IFERROR((D17+E17+F17)/AE17*100,\"\")","v":83.754193890164217},null,null,null,816,null,null,null,{"$f":"IFERROR((L17+M17+N17)/AE17*100,\"\")","v":14.409323680028255},null,null,null,104,null,null,null,{"$f":"IFERROR((T17+U17+V17)/AE17*100,\"\")","v":1.8364824298075226},null,null,null,{"$f":"IF(SUM(D17:G17,L17:O17,T17:W17)=0,\"\",SUM(D17:G17,L17:O17,T17:W17))","v":5663},null,null,{"$f":"IF(MATRICULA!AF33=0,\"\",MATRICULA!AF33)","v":5663}]
[{"$f":"IF(MATRICULA!B18=0,\"\",MATRICULA!B18)","v":"Particulares"},null,null,1175,null,null,null,{"$f":"IFERROR((D18+E18+F18)/AE18*100,\"\")","v":97.510373443983397},null,null,null,30,null,null,null,{"$f":"IFERROR((L18+M18+N18)/AE18*100,\"\")","v":2.4896265560165975},null,null,null,0,null,null,null,{"$f":"IFERROR((T18+U18+V18)/AE18*100,\"\")","v":0},null,null,null,{"$f":"IF(SUM(D18:G18,L18:O18,T18:W18)=0,\"\",SUM(D18:G18,L18:O18,T18:W18))","v":1205},null,null,{"$f":"IF(MATRICULA!AF34=0,\"\",MATRICULA!AF34)","v":1205}]
[{"$f":"IF(MATRICULA!B19=0,\"\",MATRICULA!B19)","v":"Secundaria Técnica"},null,null,4327,null,null,null,84.660536098610834,null,null,null,714,null,null,null,13.9698689101937,null,null,null,70,null,null,null,1.3695949911954608,null,null,null,5111,null,null,{"$f":"IF(MATRICULA!AF35=0,\"\",MATRICULA!AF35)","v":5111}]
[{"$f":"IF(MATRICULA!B20=0,\"\",MATRICULA!B20)","v":"Telesecundaria"},null,null,1499,null,null,null,92.132759680393363,null,null,null,99,null,null,null,6.084818684695759,null,null,null,29,null,null,null,1.782421634910879,null,null,null,1627,null,null,{"$f":"IF(MATRICULA!AF36=0,\"\",MATRICULA!AF36)","v":1627}]
[{"$f":"IF(MATRICULA!B21=0,\"\",MATRICULA!B21)","v":""},null,null,null,null,null,null,"",null,null,null,null,null,null,null,"",null,null,null,null,null,null,null,"",null,null,null,"",null,null,{"$f":"IF(MATRICULA!AF37=0,\"\",MATRICULA!AF37)","v":""}]
[{"$f":"IF(MATRICULA!B22=0,\"\",MATRICULA!B22)","v":""},null,null,null,null,null,null,"",null,null,null,null,null,null,null,"",null,null,null,null,null,null,null,"",null,null,null,"",null,null,{"$f":"IF(MATRICULA!AF38=0,\"\",MATRICULA!AF38)","v":""}]
[{"$f":"IF(MATRICULA!B23=0,\"\",MATRICULA!B23)","v":""},null,null,null,null,null,null,"",null,null,null,null,null,null,null,"",null,null,null,null,null,null,null,"",null,null,null,"",null,null,{"$f":"IF(MATRICULA!AF39=0,\"\",MATRICULA!AF39)","v":""}]
[{"$f":"IF(MATRICULA!B24=0,\"\",MATRICULA!B24)","v":""},null,null,null,null,null,null,"",null,null,null,null,null,null,null,"",null,null,null,null,null,null,null,"",null,null,null,"",null,null,{"$f":"IF(MATRICULA!AF40=0,\"\",MATRICULA!AF40)","v":""}]
[{"$f":"IF(MATRICULA!B25=0,\"\",MATRICULA!B25)","v":""},null,null,null,null,null,null,"",null,null,null,null,null,null,null,"",null,null,null,null,null,null,null,"",null,null,null,"",null,null,{"$f":"IF(MATRICULA!AF41=0,\"\",MATRICULA!AF41)","v":""}]
[{"$f":"IF(MATRICULA!B26=0,\"\",MATRICULA!B26)","v":""},null,null,null,null,null,null,"",null,null,null,null,null,null,null,"",null,null,null,null,null,null,null,"",null,null,null,"",null,null,{"$f":"IF(MATRICULA!AF42=0,\"\",MATRICULA!AF42)","v":""}]
["TOTAL",null,null,{"$f":"SUM(D17:D26)","v":11744},null,null,null,86.314861090695288,null,null,null,{"$f":"SUM(L17:L26)","v":1659},null,null,null,12.193150080846685,null,null,null,{"$f":"SUM(T17:T26)","v":203},null,null,null,1.4919888284580332,null,null,null,{"$f":"SUM(AB17:AD26)","v":13606},null,null,{"$f":"SUM(AE17:AG26)","v":13606}]

{"sheet":"Gráfica APROV 2","index":7,"n_rows":14,"n_cols":10,"rows_kept":14,"cut":false,"hidden":false,"merged":[[8,0,8,5],[8,7,8,25],[6,1,6,12],[6,13,6,25],[0,0,0,32],[2,1,2,29],[3,1,3,29],[4,1,4,29],[5,1,5,12],[5,13,5,25],[9,0,9,2],[9,7,9,25],[9,26,9,30],[10,26,10,30],[10,0,10,2],[10,3,10,11],[10,12,10,13],[10,15,10,22],[10,23,10,24]]}
[]
[]
[null,"Secretaría de Educación Pública del Estado de Baja California Sur"]
[null,"Dirección de Educación Secundaria"]
[null,"SEGUNDO GRADO"]
[]
[]
[]
["DIRECCIÓN: ",null,null,null,null,null,null,"EDUCACIÓN SECUNDARIA"]
["DIRECTORA:",null,null,null,null,null,null,"MTRA. OFELIA ELIZABETH OCHOA ROMERO"]
[]
[]
[null,"Lengua Materna","Matemáticas","Inglés","Ciencias y tecnología (Física)","Historia ","Formación Cívica y Ética ","Tecnología II","Educación Física","Artes"]
[null,{"$f":"'APROV 2'!B27:D27","v":8.5},{"$f":"'APROV 2'!E27","v":8.4},{"$f":"'APROV 2'!H27","v":8.6},{"$f":"'APROV 2'!K27","v":8.5},{"$f":"'APROV 2'!N27","v":8.6},{"$f":"'APROV 2'!Q27","v":8.8000000000000007},{"$f":"'APROV 2'!T27","v":9},{"$f":"'APROV 2'!W27","v":9.3000000000000007},{"$f":"'APROV 2'!Z27","v":9}]

{"sheet":"Gráfica PART 2","index":8,"n_rows":14,"n_cols":14,"rows_kept":14,"cut":false,"hidden":false,"merged":[[0,0,0,32],[2,1,2,29],[3,1,3,29],[4,1,4,29],[5,1,5,12],[5,13,5,25],[10,26,10,30],[6,1,6,12],[6,13,6,25],[10,0,10,2],[9,0,9,5],[9,7,9,25],[10,7,10,25]]}
[]
[]
[null,"Secretaría de Educación Pública del Estado de Baja California Sur"]
[null,"Dirección de Educación Secundaria"]
[null,"SEGUNDO GRADO "]
[null,"PERIODO EVALUACIÓN:",null,null,null,null,null,null,null,null,null,null,null,{"$f":"IF('APROV 1'!N7:Z7<>0,'APROV 1'!N7:Z7, \"\")","v":"2DO TRIMESTRE"}]
[null,"CICLO ESCOLAR :",null,null,null,null,null,null,null,null,null,null,null,{"$f":"IF('APROV 1'!N8:Z8<>0, 'APROV 1'!N8:Z8, \"\")","v":"2021-2022"}]
[]
[]
["DIRECCIÓN: ",null,null,null,null,null,null,"EDUCACIÓN SECUNDARIA"]
["DIRECTORA:",null,null,null,null,null,null,"MTRA. OFELIA ELIZABETH OCHOA ROMERO"]
[]
[null,null,null,"COMUNICACIÓN Y PARTICIPACIÓN SOSTENIDA","COMUNICACIÓN Y PARTICIPACIÓN INTERMITENTE","COMUNICACIÓN PRACTICAMENTE INEXISTENTE"]
[null,null,null,{"$f":"'PARTICIPACIÓN 2'!H27/100","v":0.86314861090695283},{"$f":"'PARTICIPACIÓN 2'!P27/100","v":0.12193150080846685},{"$f":"'PARTICIPACIÓN 2'!X27/100","v":1.4919888284580331E-2}]

{"sheet":"APROV 3","index":9,"n_rows":42,"n_cols":30,"rows_kept":42,"cut":false,"hidden":false,"merged":[[41,0,42,29],[22,1,22,3],[23,1,23,3],[24,1,24,3],[14,4,14,6],[22,4,22,6],[23,4,23,6],[24,4,24,6],[23,16,23,18],[24,16,24,18],[14,10,14,12],[22,10,22,12],[23,10,23,12],[24,10,24,12],[21,28,21,29],[23,7,23,9],[24,7,24,9],[28,0,29,0],[28,1,28,3],[28,4,28,6],[28,7,28,9],[28,10,28,12],[28,13,28,15],[22,16,22,18],[27,22,27,27],[27,28,27,29],[28,25,28,27],[28,28,28,29],[25,28,25,29],[25,25,25,27],[13,25,13,27],[14,25,14,27],[22,25,22,27],[23,25,23,27],[24,25,24,27],[13,28,13,29],[14,28,14,29],[22,28,22,29],[23,28,23,29],[24,28,24,29],[15,28,15,29],[16,28,16,29],[17,28,17,29],[18,28,18,29],[19,28,19,29],[20,28,20,29],[22,13,22,15],[23,13,23,15],[13,0,14,0],[14,13,14,15],[24,13,24,15],[25,13,25,15],[13,1,13,3],[13,4,13,6],[25,4,25,6],[25,1,25,3],[25,7,25,9],[14,7,14,9],[22,7,22,9],[15,4,15,6],[17,1,17,3],[17,4,17,6],[19,1,19,3],[19,4,19,6],[21,1,21,3],[21,4,21,6],[21,7,21,9],[21,10,21,12],[13,10,13,12],[14,1,14,3],[13,7,13,9],[10,7,10,25],[15,25,15,27],[16,1,16,3],[16,4,16,6],[16,7,16,9],[16,10,16,12],[16,13,16,15],[16,16,16,18],[16,19,16,21],[10,26,10,30],[12,28,12,29],[12,22,12,27],[28,16,28,18],[28,22,28,24],[13,22,13,24],[14,22,14,24],[22,22,22,24],[23,22,23,24],[24,22,24,24],[12,0,12,21],[28,19,28,21],[27,0,27,21],[13,19,13,21],[14,19,14,21],[22,19,22,21],[23,19,23,21],[24,19,24,21],[15,1,15,3],[21,16,21,18],[21,19,21,21],[19,7,19,9],[19,10,19,12],[25,16,25,18],[25,22,25,24],[25,10,25,12],[25,19,25,21],[20,1,20,3],[2,1,2,26],[3,1,3,26],[5,1,5,26],[6,1,6,12],[7,1,7,12],[6,13,6,23],[4,1,4,26],[7,13,7,23],[9,0,9,5],[9,7,9,25],[10,0,10,2],[11,4,11,10],[11,12,11,13],[16,22,16,24],[15,7,15,9],[15,10,15,12],[15,13,15,15],[15,16,15,18],[15,19,15,21],[15,22,15,24],[13,13,13,15],[13,16,13,18],[14,16,14,18],[21,22,21,24],[21,13,21,15],[16,25,16,27],[17,25,17,27],[18,1,18,3],[18,4,18,6],[18,7,18,9],[18,10,18,12],[18,13,18,15],[18,16,18,18],[18,19,18,21],[18,22,18,24],[18,25,18,27],[17,7,17,9],[17,10,17,12],[17,13,17,15],[17,16,17,18],[17,19,17,21],[17,22,17,24],[21,25,21,27],[19,16,19,18],[19,19,19,21],[19,22,19,24],[19,25,19,27],[19,13,19,15],[20,4,20,6],[20,7,20,9],[20,10,20,12],[20,13,20,15],[20,16,20,18],[20,19,20,21],[20,22,20,24],[20,25,20,27]]}
[]
[]
[null,"Secretaría de Educación Pública del Estado de Baja California Sur"]
[null,"Dirección de Educación Secundaria"]
[null,"APROVECHAMIENTO Y RIESGO DE NO ACREDITAR"]
[null,"TERCER GRADO"]
[null,"PERIODO EVALUACIÓN:",null,null,null,null,null,null,null,null,null,null,null,{"$f":"IF('APROV 1'!N7:Z7<>0,'APROV 1'!N7:Z7, \"\")","v":"2DO TRIMESTRE"}]
[null,"CICLO ESCOLAR :",null,null,null,null,null,null,null,null,null,null,null,{"$f":"IF('APROV 1'!N8:Z8<>0, 'APROV 1'!N8:Z8, \"\")","v":"2021-2022"}]
[]
["DIRECCIÓN: ",null,null,null,null,null,null,"EDUCACIÓN SECUNDARIA"]
["DIRECTORA:",null,null,null,null,null,null,"MTRA. OFELIA ELIZABETH OCHOA ROMERO"]
[]
["Promedio de Aprovechamiento de los Campos de Formación Académica",null,null,null,null,null,null,null,null,null,null,null,null,null,null,null,null,null,null,null,null,null,"Promedio de Aprovechamiento de las Áreas de Desarrollo Personal y Social"]
["Zona escolar","Español III",null,null,"Matemáticas III",null,null,"Segunda Lengua: Inglés III",null,null,"Ciencias III (Énfasis en Química)",null,null,"Historia II",null,null,"Formación Cívica y Ética II",null,null,"Tecnología III",null,null,"Educación Física III",null,null,"Artes III",null,null,"Prom. Final"]
[null,"CALIF",null,null,"CALIF",null,null,"CALIF",null,null,"CALIF",null,null,"CALIF",null,null,"CALIF",null,null,"CALIF",null,null,"CALIF",null,null,"CALIF",null,null,"CALIF"]
[{"$f":"IF(MATRICULA!B17=0,\"\",MATRICULA!B17)","v":"Generales Públicas"},8.5,null,null,8.3000000000000007,null,null,8.6999999999999993,null,null,8.6999999999999993,null,null,8.6999999999999993,null,null,8.6999999999999993,null,null,8.9,null,null,9.1999999999999993,null,null,9,null,null,{"$f":"IFERROR(ROUND(AVERAGE(B16:AB16),1),\"\")","v":8.6999999999999993}]
[{"$f":"IF(MATRICULA!B18=0,\"\",MATRICULA!B18)","v":"Particulares"},8.8000000000000007,null,null,8.5,null,null,8.6,null,null,8.4,null,null,8.8000000000000007,null,null,9,null,null,9.1,null,null,9.6,null,null,9.1999999999999993,null,null,8.9]
[{"$f":"IF(MATRICULA!B19=0,\"\",MATRICULA!B19)","v":"Secundaria Técnica"},8.5,null,null,8.1999999999999993,null,null,8.5,null,null,8.5,null,null,8.5,null,null,8.4,null,null,8.6999999999999993,null,null,9.1999999999999993,null,null,8.6,null,null,8.6]
[{"$f":"IF(MATRICULA!B20=0,\"\",MATRICULA!B20)","v":"Telesecundaria"},8.4,null,null,8.1999999999999993,null,null,8.1999999999999993,null,null,8.3000000000000007,null,null,8.3000000000000007,null,null,8.6,null,null,9,null,null,9.1,null,null,8.9,null,null,8.6]
[{"$f":"IF(MATRICULA!B21=0,\"\",MATRICULA!B21)","v":""},null,null,null,null,null,null,null,null,null,null,null,null,null,null,null,null,null,null,null,null,null,null,null,null,null,null,null,""]
[{"$f":"IF(MATRICULA!B22=0,\"\",MATRICULA!B22)","v":""},null,null,null,null,null,null,null,null,null,null,null,null,null,null,null,null,null,null,null,null,null,null,null,null,null,null,null,""]
[{"$f":"IF(MATRICULA!B23=0,\"\",MATRICULA!B23)","v":""},null,null,null,null,null,null,null,null,null,null,null,null,null,null,null,null,null,null,null,null,null,null,null,null,null,null,null,""]
[{"$f":"IF(MATRICULA!B24=0,\"\",MATRICULA!B24)","v":""},null,null,null,null,null,null,null,null,null,null,null,null,null,null,null,null,null,null,null,null,null,null,null,null,null,null,null,{"$f":"IFERROR(ROUND(AVERAGE(B23:AB23),1),\"\")","v":""}]
[{"$f":"IF(MATRICULA!B25=0,\"\",MATRICULA!B25)","v":""},null,null,null,null,null,null,null,null,null,null,null,null,null,null,null,null,null,null,null,null,null,null,null,null,null,null,null,""]
[{"$f":"IF(MATRICULA!B26=0,\"\",MATRICULA!B26)","v":""},null,null,null,null,null,null,null,null,null,null,null,null,null,null,null,null,null,null,null,null,null,null,null,null,null,null,null,""]
["Gral.",{"$f":"IFERROR(ROUND(AVERAGE(B16:D25),1),\"\")","v":8.6},null,null,{"$f":"IFERROR(ROUND(AVERAGE(E16:G25),1),\"\")","v":8.3000000000000007},null,null,{"$f":"IFERROR(ROUND(AVERAGE(H16:J25),1),\"\")","v":8.5},null,null,{"$f":"IFERROR(ROUND(AVERAGE(K16:M25),1),\"\")","v":8.5},null,null,{"$f":"IFERROR(ROUND(AVERAGE(N16:P25),1),\"\")","v":8.6},null,null,{"$f":"IFERROR(ROUND(AVERAGE(Q16:S25),1),\"\")","v":8.6999999999999993},null,null,{"$f":"IFERROR(ROUND(AVERAGE(T16:V25),1),\"\")","v":8.9},null,null,{"$f":"IFERROR(ROUND(AVERAGE(W16:Y25),1),\"\")","v":9.3000000000000007},null,null,{"$f":"IFERROR(ROUND(AVERAGE(Z16:AB25),1),\"\")","v":8.9},null,null,{"$f":"IFERROR(ROUND(AVERAGE(AC16:AD25),1),\"\")","v":8.6999999999999993}]
[]
["Campos de Formación Académica en situacion de riesgo de no acreditar",null,null,null,null,null,null,null,null,null,null,null,null,null,null,null,null,null,null,null,null,null,"Áreas de Desarrollo Personal y Social en situación de riesgo de no acreditar"]
["Zona escolar","Español III",null,null,"Matemáticas III",null,null,"Segunda Lengua: Inglés III",null,null,"Ciencias III (Énfasis en Química)",null,null,"Historia II",null,null,"Formación Cívica y Ética II",null,null,"Tecnología III",null,null,"Educación Física III",null,null,"Artes III",null,null,"Total"]
[null,5,6,"T",5,6,"T",5,6,"T",5,6,"T",5,6,"T",5,6,"T",5,6,"T",5,6,"T",5,6,"T",5,6]
[{"$f":"IF(MATRICULA!B17=0,\"\",MATRICULA!B17)","v":"Generales Públicas"},null,282,{"$f":"IF(SUM(B31,C31)=0,\"\",SUM(B31,C31))","v":282},null,482,{"$f":"IF(SUM(E31,F31)=0,\"\",SUM(E31,F31))","v":482},null,290,{"$f":"IF(SUM(H31,I31)=0,\"\",SUM(H31,I31))","v":290},null,354,{"$f":"IF(SUM(K31,L31)=0,\"\",SUM(K31,L31))","v":354},null,305,{"$f":"IF(SUM(N31,O31)=0,\"\",SUM(N31,O31))","v":305},null,371,{"$f":"IF(SUM(Q31,R31)=0,\"\",SUM(Q31,R31))","v":371},null,301,{"$f":"IF(SUM(T31,U31)=0,\"\",SUM(T31,U31))","v":301},null,147,{"$f":"IF(SUM(W31,X31)=0,\"\",SUM(W31,X31))","v":147},null,234,{"$f":"IF(SUM(Z31,AA31)=0,\"\",SUM(Z31,AA31))","v":234},{"$f":"IF(SUM(B31,E31,H31,K31,N31,Q31,T31,W31,Z31)=0,\"\",SUM(B31,E31,H31,K31,N31,Q31,T31,W31,Z31))","v":""},{"$f":"IF(SUM(C31,F31,I31,L31,O31,R31,U31,X31,AA31)=0,\"\",SUM(C31,F31,I31,L31,O31,R31,U31,X31,AA31))","v":2766}]
[{"$f":"IF(MATRICULA!B18=0,\"\",MATRICULA!B18)","v":"Particulares"},null,43,43,null,88,88,null,52,52,null,47,47,null,30,30,null,27,27,null,33,33,null,28,28,null,20,20,"",368]
[{"$f":"IF(MATRICULA!B19=0,\"\",MATRICULA!B19)","v":"Secundaria Técnica"},null,611,611,null,608,608,null,518,518,null,675,675,null,511,511,null,663,663,null,472,472,null,325,325,null,597,597,"",4980]
[{"$f":"IF(MATRICULA!B20=0,\"\",MATRICULA!B20)","v":"Telesecundaria"},null,184,184,null,206,206,null,187,187,null,207,207,null,231,231,null,191,191,null,166,166,null,158,158,null,164,164,"",1694]
[{"$f":"IF(MATRICULA!B21=0,\"\",MATRICULA!B21)","v":""},null,null,"",null,null,"",null,null,"",null,null,"",null,null,"",null,null,"",null,null,"",null,null,"",null,null,"","",""]
[{"$f":"IF(MATRICULA!B22=0,\"\",MATRICULA!B22)","v":""},null,null,"",null,null,"",null,null,"",null,null,"",null,null,"",null,null,"",null,null,"",null,null,"",null,null,"","",""]
[{"$f":"IF(MATRICULA!B23=0,\"\",MATRICULA!B23)","v":""},null,null,"",null,null,"",null,null,"",null,null,"",null,null,"",null,null,"",null,null,"",null,null,"",null,null,"","",""]
[{"$f":"IF(MATRICULA!B24=0,\"\",MATRICULA!B24)","v":""},null,null,{"$f":"IF(SUM(B38,C38)=0,\"\",SUM(B38,C38))","v":""},null,null,{"$f":"IF(SUM(E38,F38)=0,\"\",SUM(E38,F38))","v":""},null,null,{"$f":"IF(SUM(H38,I38)=0,\"\",SUM(H38,I38))","v":""},null,null,{"$f":"IF(SUM(K38,L38)=0,\"\",SUM(K38,L38))","v":""},null,null,{"$f":"IF(SUM(N38,O38)=0,\"\",SUM(N38,O38))","v":""},null,null,{"$f":"IF(SUM(Q38,R38)=0,\"\",SUM(Q38,R38))","v":""},null,null,{"$f":"IF(SUM(T38,U38)=0,\"\",SUM(T38,U38))","v":""},null,null,{"$f":"IF(SUM(W38,X38)=0,\"\",SUM(W38,X38))","v":""},null,null,{"$f":"IF(SUM(Z38,AA38)=0,\"\",SUM(Z38,AA38))","v":""},{"$f":"IF(SUM(B38,E38,H38,K38,N38,Q38,T38,W38,Z38)=0,\"\",SUM(B38,E38,H38,K38,N38,Q38,T38,W38,Z38))","v":""},""]
[{"$f":"IF(MATRICULA!B25=0,\"\",MATRICULA!B25)","v":""},null,null,"",null,null,"",null,null,"",null,null,"",null,null,"",null,null,"",null,null,"",null,null,"",null,null,"","",""]
[{"$f":"IF(MATRICULA!B26=0,\"\",MATRICULA!B26)","v":""},null,null,"",null,null,"",null,null,"",null,null,"",null,null,"",null,null,"",null,null,"",null,null,"",null,null,"","",""]
["Total",{"$f":"IF(SUM(B31:B40)=0,\"\",SUM(B31:B40))","v":""},1120,1120,"",1384,1384,"",1047,1047,"",1283,1283,"",1077,1077,"",1252,1252,"",972,972,"",658,658,"",1015,1015,"",9808]
["Nota: Para las columnas \"Campos de Formación Académica y Áreas de Desarrollo Personal y Social en riesgo de no acreditar\" registre la cantidad de cincos o seis que existen en cada campo o área."]

{"sheet":"PARTICIPACIÓN 3","index":10,"n_rows":27,"n_cols":31,"rows_kept":27,"cut":false,"hidden":false,"merged":[[13,0,13,32],[14,0,15,2],[24,3,24,6],[25,3,25,6],[26,3,26,6],[26,11,26,14],[26,19,26,22],[24,19,24,22],[25,19,25,22],[16,11,16,14],[17,11,17,14],[18,11,18,14],[19,11,19,14],[20,11,20,14],[21,11,21,14],[22,11,22,14],[23,11,23,14],[24,11,24,14],[25,11,25,14],[14,7,15,10],[14,15,15,18],[14,23,15,26],[14,30,15,32],[14,3,15,6],[10,0,10,5],[10,7,10,25],[11,0,11,2],[11,7,11,25],[11,26,11,30],[0,0,0,32],[2,1,2,30],[3,1,3,30],[4,1,4,30],[5,1,5,30],[6,13,6,25],[7,13,7,25],[6,1,6,11],[7,1,7,11],[14,11,15,14],[14,19,15,22],[16,0,16,2],[16,7,16,10],[16,15,16,18],[16,23,16,26],[16,30,16,32],[14,27,15,29],[17,0,17,2],[17,7,17,10],[17,15,17,18],[17,23,17,26],[17,30,17,32],[16,27,16,29],[17,27,17,29],[16,19,16,22],[17,19,17,22],[16,3,16,6],[17,3,17,6],[18,23,18,26],[18,30,18,32],[19,0,19,2],[19,7,19,10],[19,15,19,18],[19,23,19,26],[19,30,19,32],[18,0,18,2],[18,7,18,10],[18,15,18,18],[18,27,18,29],[19,27,19,29],[18,19,18,22],[19,19,19,22],[18,3,18,6],[19,3,19,6],[20,23,20,26],[20,30,20,32],[21,0,21,2],[21,7,21,10],[21,15,21,18],[21,23,21,26],[21,30,21,32],[20,0,20,2],[20,7,20,10],[20,15,20,18],[20,27,20,29],[21,27,21,29],[20,19,20,22],[21,19,21,22],[20,3,20,6],[21,3,21,6],[22,23,22,26],[22,30,22,32],[23,0,23,2],[23,7,23,10],[23,15,23,18],[23,23,23,26],[23,30,23,32],[22,0,22,2],[22,7,22,10],[22,15,22,18],[22,27,22,29],[23,27,23,29],[22,19,22,22],[23,19,23,22],[22,3,22,6],[23,3,23,6],[26,23,26,26],[26,30,26,32],[26,0,26,2],[26,7,26,10],[26,15,26,18],[24,23,24,26],[24,30,24,32],[25,0,25,2],[25,7,25,10],[25,15,25,18],[25,23,25,26],[25,30,25,32],[24,0,24,2],[24,7,24,10],[24,15,24,18],[24,27,24,29],[25,27,25,29],[26,27,26,29]]}
[]
[]
[null,"Secretaría de Educación Pública del Estado de Baja California Sur"]
[null,"Dirección de Educación Secundaria"]
[null,"NIVELES DE COMUNICACIÓN Y PARTICIPACIÓN DE ALUMNOS"]
[null,"TERCER GRADO "]
[null,"PERIODO EVALUACIÓN:",null,null,null,null,null,null,null,null,null,null,null,{"$f":"IF('APROV 1'!N7:Z7<>0,'APROV 1'!N7:Z7, \"\")","v":"2DO TRIMESTRE"}]
[null,"CICLO ESCOLAR :",null,null,null,null,null,null,null,null,null,null,null,{"$f":"IF('APROV 1'!N8:Z8<>0, 'APROV 1'!N8:Z8, \"\")","v":"2021-2022"}]
[]
[]
["DIRECCIÓN: ",null,null,null,null,null,null,"EDUCACIÓN SECUNDARIA"]
["DIRECTORA:",null,null,null,null,null,null,"MTRA. OFELIA ELIZABETH OCHOA ROMERO"]
[]
[" COMUNICACIÓN Y PARTICIPACIÓN CON ALUMNOS  (Registrar cantidad de alumnos)"]
["Modalidad",null,null,"COMUNICACIÓN Y PARTICIPACIÓN SOSTENIDA",null,null,null,"%",null,null,null,"COMUNICACIÓN Y PARTICIPACIÓN INTERMITENTE",null,null,null,"%",null,null,null,"COMUNICACIÓN PRACTICAMENTE INEXISTENTE",null,null,null,"%",null,null,null,"TOTAL",null,null,"MATRÍCULA\nEXISTENCIA"]
[]
[{"$f":"IF(MATRICULA!B17=0,\"\",MATRICULA!B17)","v":"Generales Públicas"},null,null,4326,null,null,null,{"$f":"IFERROR((D17+E17+F17)/AE17*100,\"\")","v":81.026409439970024},null,null,null,879,null,null,null,{"$f":"IFERROR((L17+M17+N17)/AE17*100,\"\")","v":16.463757257913468},null,null,null,134,null,null,null,{"$f":"IFERROR((T17+U17+V17)/AE17*100,\"\")","v":2.5098333021165011},null,null,null,{"$f":"IF(SUM(D17:G17,L17:O17,T17:W17)=0,\"\",SUM(D17:G17,L17:O17,T17:W17))","v":5339},null,null,{"$f":"IF(MATRICULA!AI33=0,\"\",MATRICULA!AI33)","v":5339}]
[{"$f":"IF(MATRICULA!B18=0,\"\",MATRICULA!B18)","v":"Particulares"},null,null,1169,null,null,null,{"$f":"IFERROR((D18+E18+F18)/AE18*100,\"\")","v":97.660818713450297},null,null,null,28,null,null,null,{"$f":"IFERROR((L18+M18+N18)/AE18*100,\"\")","v":2.3391812865497075},null,null,null,0,null,null,null,{"$f":"IFERROR((T18+U18+V18)/AE18*100,\"\")","v":0},null,null,null,{"$f":"IF(SUM(D18:G18,L18:O18,T18:W18)=0,\"\",SUM(D18:G18,L18:O18,T18:W18))","v":1197},null,null,{"$f":"IF(MATRICULA!AI34=0,\"\",MATRICULA!AI34)","v":1197}]
[{"$f":"IF(MATRICULA!B19=0,\"\",MATRICULA!B19)","v":"Secundaria Técnica"},null,null,4210,null,null,null,84.015166633406508,null,null,null,734,null,null,null,14.647774895230492,null,null,null,67,null,null,null,1.3370584713630014,null,null,null,5011,null,null,{"$f":"IF(MATRICULA!AI35=0,\"\",MATRICULA!AI35)","v":5011}]
[{"$f":"IF(MATRICULA!B20=0,\"\",MATRICULA!B20)","v":"Telesecundaria"},null,null,1488,null,null,null,90.34608378870675,null,null,null,114,null,null,null,6.9216757741347905,null,null,null,45,null,null,null,2.7322404371584699,null,null,null,1647,null,null,{"$f":"IF(MATRICULA!AI36=0,\"\",MATRICULA!AI36)","v":1647}]
[{"$f":"IF(MATRICULA!B21=0,\"\",MATRICULA!B21)","v":""},null,null,null,null,null,null,"",null,null,null,null,null,null,null,"",null,null,null,null,null,null,null,"",null,null,null,"",null,null,{"$f":"IF(MATRICULA!AI37=0,\"\",MATRICULA!AI37)","v":""}]
[{"$f":"IF(MATRICULA!B22=0,\"\",MATRICULA!B22)","v":""},null,null,null,null,null,null,"",null,null,null,null,null,null,null,"",null,null,null,null,null,null,null,"",null,null,null,"",null,null,{"$f":"IF(MATRICULA!AI38=0,\"\",MATRICULA!AI38)","v":""}]
[{"$f":"IF(MATRICULA!B23=0,\"\",MATRICULA!B23)","v":""},null,null,null,null,null,null,"",null,null,null,null,null,null,null,"",null,null,null,null,null,null,null,"",null,null,null,"",null,null,{"$f":"IF(MATRICULA!AI39=0,\"\",MATRICULA!AI39)","v":""}]
[{"$f":"IF(MATRICULA!B24=0,\"\",MATRICULA!B24)","v":""},null,null,null,null,null,null,"",null,null,null,null,null,null,null,"",null,null,null,null,null,null,null,"",null,null,null,"",null,null,{"$f":"IF(MATRICULA!AI40=0,\"\",MATRICULA!AI40)","v":""}]
[{"$f":"IF(MATRICULA!B25=0,\"\",MATRICULA!B25)","v":""},null,null,null,null,null,null,"",null,null,null,null,null,null,null,"",null,null,null,null,null,null,null,"",null,null,null,"",null,null,{"$f":"IF(MATRICULA!AI41=0,\"\",MATRICULA!AI41)","v":""}]
[{"$f":"IF(MATRICULA!B26=0,\"\",MATRICULA!B26)","v":""},null,null,null,null,null,null,"",null,null,null,null,null,null,null,"",null,null,null,null,null,null,null,"",null,null,null,"",null,null,{"$f":"IF(MATRICULA!AI42=0,\"\",MATRICULA!AI42)","v":""}]
["TOTAL",null,null,{"$f":"SUM(D17:D26)","v":11193},null,null,null,84.834015461573443,null,null,null,{"$f":"SUM(L17:L26)","v":1755},null,null,null,13.301500682128239,null,null,null,{"$f":"SUM(T17:T26)","v":246},null,null,null,1.8644838562983175,null,null,null,{"$f":"SUM(AB17:AD26)","v":13194},null,null,{"$f":"SUM(AE17:AG26)","v":13194}]

{"sheet":"Gráfica APROV 3","index":11,"n_rows":13,"n_cols":14,"rows_kept":13,"cut":false,"hidden":false,"merged":[[6,13,6,23],[5,13,5,23],[0,0,0,32],[2,1,2,29],[3,1,3,29],[4,1,4,29],[5,1,5,12],[6,1,6,12],[9,26,9,30],[11,0,28,0],[11,10,28,16],[9,0,9,2],[8,0,8,5],[8,7,8,25],[9,7,9,25]]}
[]
[]
[null,"Secretaría de Educación Pública del Estado de Baja California Sur"]
[null,"Dirección de Educación Secundaria"]
[null,"TERCER GRADO"]
[null,"PERIODO EVALUACIÓN:",null,null,null,null,null,null,null,null,null,null,null,{"$f":"IF('APROV 1'!N7:Z7<>0,'APROV 1'!N7:Z7, \"\")","v":"2DO TRIMESTRE"}]
[null,"CICLO ESCOLAR :",null,null,null,null,null,null,null,null,null,null,null,{"$f":"IF('APROV 1'!N8:Z8<>0, 'APROV 1'!N8:Z8, \"\")","v":"2021-2022"}]
[]
["DIRECCIÓN: ",null,null,null,null,null,null,"EDUCACIÓN SECUNDARIA"]
["DIRECTORA:",null,null,null,null,null,null,"MTRA. OFELIA ELIZABETH OCHOA ROMERO"]
[]
[null,"Español III","Matemáticas III","Segunda Lengua: Inglés III","Ciencias III (Énfasis en Química)","Historia II","Formación Cívica y Ética II","Tecnología III","Educación Física III","Artes III"]
[null,{"$f":"'APROV 3'!B26:D26","v":8.6},{"$f":"'APROV 3'!E26","v":8.3000000000000007},{"$f":"'APROV 3'!H26","v":8.5},{"$f":"'APROV 3'!K26","v":8.5},{"$f":"'APROV 3'!N26","v":8.6},{"$f":"'APROV 3'!Q26","v":8.6999999999999993},{"$f":"'APROV 3'!T26","v":8.9},{"$f":"'APROV 3'!W26","v":9.3000000000000007},{"$f":"'APROV 3'!Z26","v":8.9}]

{"sheet":"Gráfica PART 3","index":12,"n_rows":14,"n_cols":14,"rows_kept":14,"cut":false,"hidden":false,"merged":[[0,0,0,32],[2,1,2,29],[3,1,3,29],[4,1,4,29],[5,1,5,12],[5,13,5,25],[10,26,10,30],[6,1,6,12],[6,13,6,25],[10,0,10,2],[9,0,9,5],[9,7,9,25],[10,7,10,25]]}
[]
[]
[null,"Secretaría de Educación Pública del Estado de Baja California Sur"]
[null,"Dirección de Educación Secundaria"]
[null,"TERCER GRADO "]
[null,"PERIODO EVALUACIÓN:",null,null,null,null,null,null,null,null,null,null,null,{"$f":"IF('APROV 1'!N7:Z7<>0,'APROV 1'!N7:Z7, \"\")","v":"2DO TRIMESTRE"}]
[null,"CICLO ESCOLAR :",null,null,null,null,null,null,null,null,null,null,null,{"$f":"IF('APROV 1'!N8:Z8<>0, 'APROV 1'!N8:Z8, \"\")","v":"2021-2022"}]
[]
[]
["DIRECCIÓN: ",null,null,null,null,null,null,"EDUCACIÓN SECUNDARIA"]
["DIRECTORA:",null,null,null,null,null,null,"MTRA. OFELIA ELIZABETH OCHOA ROMERO"]
[]
[null,null,null,"COMUNICACIÓN Y PARTICIPACIÓN SOSTENIDA","COMUNICACIÓN Y PARTICIPACIÓN INTERMITENTE","COMUNICACIÓN PRACTICAMENTE INEXISTENTE"]
[null,null,null,{"$f":"'PARTICIPACIÓN 3'!H27/100","v":0.84834015461573442},{"$f":"'PARTICIPACIÓN 3'!P27/100","v":0.13301500682128239},{"$f":"'PARTICIPACIÓN 3'!X27/100","v":1.8644838562983174E-2}]

{"sheet":"Gráfica Promedios Finales","index":13,"n_rows":15,"n_cols":14,"rows_kept":15,"cut":false,"hidden":false,"merged":[[0,0,0,31],[2,1,2,29],[3,1,3,29],[4,1,4,12],[5,1,5,12],[5,13,5,25],[4,13,4,25],[7,0,7,5],[7,7,7,25],[8,0,8,2],[25,0,105,31],[8,7,8,25],[8,26,8,30]]}
[]
[]
[null,"Secretaría de Educación Pública del Estado de Baja California Sur"]
[null,"Dirección de Educación Secundaria"]
[null,"PERIODO DE EVALUACIÓN:",null,null,null,null,null,null,null,null,null,null,null,{"$f":"IF('APROV 1'!N7:Z7<>0,'APROV 1'!N7:Z7, \"\")","v":"2DO TRIMESTRE"}]
[null,"CICLO ESCOLAR :",null,null,null,null,null,null,null,null,null,null,null,{"$f":"IF('APROV 1'!N8:Z8<>0, 'APROV 1'!N8:Z8, \"\")","v":"2021-2022"}]
[]
["DIRECCIÓN: ",null,null,null,null,null,null,"EDUCACIÓN SECUNDARIA"]
["DIRECTORA:",null,null,null,null,null,null,"MTRA. OFELIA ELIZABETH OCHOA ROMERO"]
[]
[]
[]
[]
[null,"PROMEDIO 1RO","PROMEDIO 2DO","PROMEDIO 3ERO"]
[null,{"$f":"+'APROV 1'!AF26","v":8.6999999999999993},{"$f":"+'APROV 2'!AC27","v":8.6999999999999993},{"$f":"'APROV 3'!AC26","v":8.6999999999999993}]

{"sheet":"NORMALIDAD MÍNIMA","index":14,"n_rows":60,"n_cols":16,"rows_kept":60,"cut":false,"hidden":false,"merged":[[9,26,9,30],[61,0,77,15],[52,0,52,15],[60,0,60,15],[53,0,53,8],[57,0,57,8],[57,9,57,14],[55,9,55,14],[59,0,59,8],[56,0,56,8],[58,0,58,8],[58,9,58,14],[56,9,56,14],[54,0,54,8],[54,9,54,14],[55,0,55,8],[2,1,2,14],[3,1,3,14],[4,1,4,14],[5,1,5,7],[6,1,6,6],[5,8,5,12],[6,8,6,12],[8,0,8,5],[8,7,8,25],[9,0,9,2],[9,7,9,25],[39,0,40,0],[39,1,39,3],[39,4,39,6],[39,7,40,7],[11,7,12,7],[25,8,25,10],[39,8,39,10],[25,1,37,3],[25,4,25,6],[25,7,26,7],[39,11,39,12],[39,13,39,14],[53,9,53,14],[38,0,38,15],[11,13,11,14],[24,0,24,15],[11,8,11,10],[11,11,11,12],[11,0,12,0],[11,1,11,3],[11,4,11,6],[25,11,25,12],[25,13,25,14],[25,0,26,0]]}
[]
[]
[null,"Secretaría de Educación Pública del Estado de Baja California Sur"]
[null,"Dirección de Educación Secundaria"]
[null,"NORMALIDAD MÍNIMA"]
[null,"PERIODO DE EVALUACIÓN:",null,null,null,null,null,null,{"$f":"IF('APROV 1'!N7<>0,'APROV 1'!N7, \"\")","v":"2DO TRIMESTRE"}]
[null,"CICLO ESCOLAR :",null,null,null,null,null,null,{"$f":"IF('APROV 1'!N8<>0, 'APROV 1'!N8, \"\")","v":"2021-2022"}]
[]
["DIRECCIÓN: ",null,null,null,null,null,null,"EDUCACIÓN SECUNDARIA"]
["DIRECTORA:",null,null,null,null,null,null,"MTRA. OFELIA ELIZABETH OCHOA ROMERO"]
[]
["Modalidad","DIRECTIVOS\n(Directores, subdirectores)",null,null,"COORDINADORES",null,null,"R","INASISTENCIAS",null,null,"LICENCIAS ECONÓMICAS",null,"LICENCIAS MÉDICAS",null,"TOTAL DE DÍAS NO LABORADOS"]
[null,"H","M","T","H","M","T",null,"I ","P.D.","D.N.L.I y P.D.","L.E."," D.N.L.E.","L.M.","D.N.L.M.","DNLI y PD, DNLE, DNLM"]
[{"$f":"IF(MATRICULA!B17=0,\"\",MATRICULA!B17)","v":"Generales Públicas"},41,26,{"$f":"IF(SUM(B14,C14)=0,\"\",SUM(B14,C14))","v":67},25,14,{"$f":"IF(SUM(E14,F14)=0,\"\",SUM(E14,F14))","v":39},null,70,8,{"$f":"IF(SUM(I14,J14)=0,\"\",SUM(I14,J14))","v":78},20,35,16,287,{"$f":"IF(SUM(K14,M14,O14)=0,\"\",SUM(K14,M14,O14))","v":400}]
[{"$f":"IF(MATRICULA!B18=0,\"\",MATRICULA!B18)","v":"Particulares"},null,null,{"$f":"IF(SUM(B15,C15)=0,\"\",SUM(B15,C15))","v":""},null,null,{"$f":"IF(SUM(E15,F15)=0,\"\",SUM(E15,F15))","v":""},null,null,null,{"$f":"IF(SUM(I15,J15)=0,\"\",SUM(I15,J15))","v":""},null,null,null,null,""]
[{"$f":"IF(MATRICULA!B19=0,\"\",MATRICULA!B19)","v":"Secundaria Técnica"},38,22,60,26,22,48,null,null,5,5,27,59,10,56,120]
[{"$f":"IF(MATRICULA!B20=0,\"\",MATRICULA!B20)","v":"Telesecundaria"},null,null,"",null,null,"",null,null,null,"",null,null,null,null,""]
[{"$f":"IF(MATRICULA!B21=0,\"\",MATRICULA!B21)","v":""},null,null,"",null,null,"",null,null,null,"",null,null,null,null,""]
[{"$f":"IF(MATRICULA!B22=0,\"\",MATRICULA!B22)","v":""},null,null,"",null,null,"",null,null,null,"",null,null,null,null,""]
[{"$f":"IF(MATRICULA!B23=0,\"\",MATRICULA!B23)","v":""},null,null,"",null,null,"",null,null,null,"",null,null,null,null,""]
[{"$f":"IF(MATRICULA!B24=0,\"\",MATRICULA!B24)","v":""},null,null,"",null,null,"",null,null,null,"",null,null,null,null,""]
[{"$f":"IF(MATRICULA!B25=0,\"\",MATRICULA!B25)","v":""},null,null,"",null,null,"",null,null,null,"",null,null,null,null,""]
[{"$f":"IF(MATRICULA!B26=0,\"\",MATRICULA!B26)","v":""},null,null,"",null,null,"",null,null,null,"",null,null,null,null,""]
["Total",{"$f":"IF(SUM(B14:B23)=0,\"\",SUM(B14:B23))","v":79},48,127,51,36,87,"",70,13,83,47,94,26,343,520]
[]
["Modalidad","PERSONAL  POR HORAS ",null,null,"DOCENTES",null,null,"R","INASISTENCIAS (Horas)",null,null,"LICENCIAS ECONÓMICAS",null,"LICENCIAS MÉDICAS",null,"TOTAL DE HORAS NO LABORADOS"]
[null,null,null,null,"H","M","T",null,"I ","P.D.","H.N.L.I y P.D.","L.E."," H.N.L.E.","L.M.","H.N.L.M.","HNLI y PD, HNLE, HNLM"]
[{"$f":"IF(MATRICULA!B17=0,\"\",MATRICULA!B17)","v":"Generales Públicas"},null,null,null,440,518,{"$f":"IF(SUM(E28,F28)=0,\"\",SUM(E28,F28))","v":958},674,1107,515,{"$f":"IF(SUM(I28,J28)=0,\"\",SUM(I28,J28))","v":1622},334,2930,152,3588,{"$f":"IF(SUM(K28,M28,O28)=0,\"\",SUM(K28,M28,O28))","v":8140}]
[{"$f":"IF(MATRICULA!B18=0,\"\",MATRICULA!B18)","v":"Particulares"},null,null,null,null,null,"",null,null,null,{"$f":"IF(SUM(I29,J29)=0,\"\",SUM(I29,J29))","v":""},null,null,null,null,""]
[{"$f":"IF(MATRICULA!B19=0,\"\",MATRICULA!B19)","v":"Secundaria Técnica"},null,null,null,392,445,837,null,1367,214,1581,507,3242,287,3014,7837]
[{"$f":"IF(MATRICULA!B20=0,\"\",MATRICULA!B20)","v":"Telesecundaria"},null,null,null,null,null,"",null,null,null,"",null,null,null,null,""]
[{"$f":"IF(MATRICULA!B21=0,\"\",MATRICULA!B21)","v":""},null,null,null,null,null,"",null,null,null,"",null,null,null,null,""]
[{"$f":"IF(MATRICULA!B22=0,\"\",MATRICULA!B22)","v":""},null,null,null,null,null,"",null,null,null,"",null,null,null,null,""]
[{"$f":"IF(MATRICULA!B23=0,\"\",MATRICULA!B23)","v":""},null,null,null,null,null,"",null,null,null,"",null,null,null,null,""]
[{"$f":"IF(MATRICULA!B24=0,\"\",MATRICULA!B24)","v":""},null,null,null,null,null,"",null,null,null,"",null,null,null,null,""]
[{"$f":"IF(MATRICULA!B25=0,\"\",MATRICULA!B25)","v":""},null,null,null,null,null,"",null,null,null,"",null,null,null,null,""]
[{"$f":"IF(MATRICULA!B26=0,\"\",MATRICULA!B26)","v":""},null,null,null,null,null,"",null,null,null,"",null,null,null,null,""]
["Total",null,null,null,{"$f":"IF(SUM(E28:E37)=0,\"\",SUM(E28:E37))","v":832},963,1795,674,2474,729,3203,841,6172,439,6602,15977]
[]
["Zona escolar","ASISTENCIA EDUCATIVA\n(Psicólogos, trabajo social, médicos, prefectos)",null,null,"ADMINISTRATIVO Y DE APOYO",null,null,"R","INASISTENCIAS",null,null,"LICENCIAS ECONÓMICAS",null,"LICENCIAS MÉDICAS",null,"TOTAL DE DÍAS NO LABORADOS"]
[null,"H","M","T","H","M","T",null,"I ","P.D.","D.N.L.I y P.D.","L.E."," D.N.L.E.","L.M.","D.N.L.M.","DNLI y PD, DNLE, DNLM"]
[{"$f":"IF(MATRICULA!B17=0,\"\",MATRICULA!B17)","v":"Generales Públicas"},64,127,{"$f":"IF(SUM(B42,C42)=0,\"\",SUM(B42,C42))","v":191},200,201,{"$f":"IF(SUM(E42,F42)=0,\"\",SUM(E42,F42))","v":401},87,165,274,{"$f":"IF(SUM(I42,J42)=0,\"\",SUM(I42,J42))","v":439},251,620,107,762,{"$f":"IF(SUM(K42,M42,O42)=0,\"\",SUM(K42,M42,O42))","v":1821}]
[{"$f":"IF(MATRICULA!B18=0,\"\",MATRICULA!B18)","v":"Particulares"},null,null,"",null,null,"",null,null,null,"",null,null,null,null,""]
[{"$f":"IF(MATRICULA!B19=0,\"\",MATRICULA!B19)","v":"Secundaria Técnica"},86,103,189,140,190,330,50,81,43,124,239,512,113,788,1424]
[{"$f":"IF(MATRICULA!B20=0,\"\",MATRICULA!B20)","v":"Telesecundaria"},null,null,"",null,null,"",null,null,null,"",null,null,null,null,""]
[{"$f":"IF(MATRICULA!B21=0,\"\",MATRICULA!B21)","v":""},null,null,"",null,null,"",null,null,null,"",null,null,null,null,""]
[{"$f":"IF(MATRICULA!B22=0,\"\",MATRICULA!B22)","v":""},null,null,"",null,null,"",null,null,null,"",null,null,null,null,""]
[{"$f":"IF(MATRICULA!B23=0,\"\",MATRICULA!B23)","v":""},null,null,"",null,null,"",null,null,null,"",null,null,null,null,""]
[{"$f":"IF(MATRICULA!B24=0,\"\",MATRICULA!B24)","v":""},null,null,"",null,null,"",null,null,null,"",null,null,null,null,""]
[{"$f":"IF(MATRICULA!B25=0,\"\",MATRICULA!B25)","v":""},null,null,"",null,null,"",null,null,null,"",null,null,null,null,""]
[{"$f":"IF(MATRICULA!B26=0,\"\",MATRICULA!B26)","v":""},null,null,"",null,null,"",null,null,null,"",null,null,null,null,""]
["Total",{"$f":"IF(SUM(B42:B51)=0,\"\",SUM(B42:B51))","v":150},230,380,340,391,731,137,246,317,563,490,1132,220,1550,3245]
[]
["NOTA:",null,null,null,null,null,null,null,null,"NOTA:"]
["I.: INASISTENCIAS",null,null,null,null,null,null,null,null,"H.N.L.E.: HORAS NO LABORADOS POR LICENCIAS ECONÓMICAS"]
["H.N.L.I.: HORAS NO LABORADAS POR INASISTENCIAS",null,null,null,null,null,null,null,null,"D.N.L.E.:  DÍAS NO LABORADOS POR LICENCIAS ECONÓMICAS"]
["D.N.L.I.: DÍAS NO LABORADOS POR INASISTENCIAS",null,null,null,null,null,null,null,null,"L.M.: PERSONAS QUE PRESENTARON LICENCIAS MÉDICAS"]
["R. :  CANTIDAD DE RETARDOS",null,null,null,null,null,null,null,null,"H.N.L.M.: HORAS NO LABORADAS POR LICENCIAS MÉDICAS"]
["L.E.:   PERSONAL QUE SOLICITÓ LICENCIAS ECONÓMICAS",null,null,null,null,null,null,null,null,"D.N.L.M.: DÍAS NO LABORADOS POR LICENCIAS MÉDICAS"]
["P.D.: PERMISOS DIRECCIÓN"]